program: Gaussian 09
title: 000183077
version: EM64L-G09RevD.01
frameworkgroup: C1[X(C16H24O3)]
method: RPBEPBE
basis: SDD
operation: Freq
keyword: #pfreq=noraman
keyword: PBEPBE/SDD
title: #p freq=noraman PBEPBE/SDD
converged: YES YES NO NO
title: Mulliken charges:
elementType: O O O C C C C C C C C C C C C C C C C H H H H H H H H H H H H H H H H H H H H H H H H
charge: -0.319781 -0.445699 -0.437788 -0.013420 -0.121563 -0.462303 -0.431898 -0.393162 -0.396631 0.122960 0.434044 0.389115 -0.346460 -0.747459 -0.719242 -0.386084 -0.395872 -0.438412 -0.392176 0.213750 0.202168 0.233001 0.215263 0.227641 0.209787 0.196459 0.208790 0.198496 0.209369 0.350151 0.210462 0.186308 0.216771 0.213881 0.236540 0.230776 0.211862 0.210143 0.256747 0.226518 0.249983 0.240658 0.346307
chargesum: 0.00000
title: Mulliken charges with hydrogens summed into heavy atoms:
elementType: O O O C C C C C C C C C C C C C C C C
charge: -0.319781 -0.095548 -0.091481 0.200331 0.080604 -0.014039 0.005530 0.012086 0.011234 0.122960 0.434044 0.389115 0.050309 -0.080266 -0.066462 -0.129336 -0.169354 -0.188430 -0.151518
polarizability: 2.54015130e+02 4.33712938e+00 1.52845525e+02 -4.06863076e+00 1.39087054e+01 1.45706767e+02
1716.lowfreq: -34.7576 -4.0003 -0.0005 0.0004 0.0008 7.5570 12.7704 32.4834 57.4654
frequency: -24.5464 30.5496 57.3920 66.8423 70.6262 117.8176 127.5699 170.1210 178.3399 186.1346 198.4628 210.5901 252.9484 282.5606 285.5729 311.2603 321.6478 338.7264 351.6002 370.9672 387.3333 401.1747 414.8874 421.1648 436.4341 449.2607 461.6867 500.3799 515.8678 543.4615 550.0649 571.0855 637.1815 664.1098 735.0748 783.8073 794.4972 821.1537 837.3222 839.1564 845.1102 859.4358 886.7200 887.9510 917.9127 935.2319 944.0798 946.2476 961.6232 968.4908 984.0240 991.5977 1001.2936 1017.9131 1027.6398 1050.2601 1059.9356 1098.1192 1100.2784 1111.9646 1121.0544 1132.3228 1145.3707 1178.9972 1181.8013 1204.3628 1208.9621 1227.1202 1230.3916 1239.6388 1259.7282 1279.8824 1291.0185 1303.5941 1308.1433 1316.0323 1322.2732 1330.2432 1338.1609 1343.7437 1359.3186 1364.6296 1372.6143 1376.7875 1384.7608 1398.0674 1414.3199 1459.8036 1466.0557 1466.3989 1468.4492 1474.9896 1475.0491 1478.7304 1481.1946 1493.4712 1499.3115 1576.9208 1617.7415 2940.8159 2946.5393 2973.1278 2975.6834 2977.4372 2979.8673 2980.3249 2992.5921 2994.5119 3041.4381 3045.0276 3056.8350 3061.5364 3064.4898 3066.3763 3074.7134 3080.7399 3085.8070 3131.4316 3147.3924 3163.5282 3169.3933 3528.2132 3540.0788
redmass: 4.0863 4.7335 3.8840 3.8053 5.4148 3.5494 3.3869 2.7490 3.0496 2.6680 1.4277 2.7020 2.4676 1.2650 3.2008 1.8646 2.2237 2.4704 1.7535 2.4181 2.4600 2.7913 2.9219 3.3411 3.3291 1.4718 2.1573 3.3374 3.0662 2.8658 2.7498 2.5853 6.6901 4.6902 3.8069 2.0775 3.2687 1.3626 1.6764 1.6292 2.4106 2.0057 2.0628 1.9559 1.9604 1.4483 1.7881 1.5897 1.4148 1.4697 3.1122 4.0015 2.9310 1.5360 2.5323 1.5374 1.8788 1.8374 1.7843 1.8299 1.4928 2.1552 1.4629 2.3427 1.4085 2.6910 1.6246 2.0902 1.3557 1.2572 1.2390 2.6023 1.2704 1.2471 1.2885 1.2904 1.2840 1.4161 1.4170 1.4892 2.3213 1.4575 1.5409 1.2742 1.7217 1.1989 3.5020 1.0743 1.0650 1.0898 1.0909 1.0623 1.0818 1.0769 1.0947 1.1794 1.8557 6.9883 6.3587 1.0827 1.0673 1.0662 1.0355 1.0621 1.0809 1.0367 1.0621 1.0653 1.0951 1.0996 1.1020 1.0965 1.1017 1.0995 1.0981 1.0999 1.0998 1.0872 1.0875 1.0940 1.0961 1.0654 1.0651
irintensity: 1.1331 0.8618 0.1914 0.1935 0.3182 2.3915 1.5907 1.6630 0.6391 0.1221 1.4939 2.1384 0.9809 1.2903 8.0068 2.3932 20.9277 5.7509 66.7326 5.9687 24.2925 47.5438 1.5396 1.3582 0.8097 106.1759 58.3220 1.3425 2.1716 19.0673 5.6874 21.2401 1.1205 7.7695 3.8427 1.2558 9.6268 18.7605 35.0626 11.2897 17.4658 22.4447 5.4686 3.6151 15.5844 8.1505 4.0160 1.3704 6.7299 2.0057 76.8657 126.1521 24.3834 3.2989 69.6687 18.8940 2.2174 7.7444 13.6399 10.3809 14.2440 3.9307 21.2017 7.4625 138.2064 2.9094 37.4737 134.7105 37.3736 1.5237 16.5208 40.7050 1.1339 9.4134 4.8404 5.7325 9.0187 17.6085 0.8764 3.7973 24.1305 7.0701 10.9975 30.1962 13.1458 20.3392 0.8608 2.4256 0.9422 7.9510 4.0077 14.6810 17.4734 2.3411 12.2704 82.8833 120.8570 3.3035 67.7132 27.1255 58.8725 24.2635 31.3622 39.8203 11.0354 29.3557 2.7277 65.4738 54.4586 56.3094 27.3300 9.2690 64.6617 16.4650 106.6323 24.4425 25.5492 18.2601 6.7277 22.7820 2.7894 4.7691 7.2739
temp: 298.150 k
press: 1.00000 atm
elementType: 8 8 8 6 6 6 6 6 6 6 6 6 6 6 6 6 6 6 6 1 1 1 1 1 1 1 1 1 1 1 1 1 1 1 1 1 1 1 1 1 1 1 1
symmnumber: 1
zpe: 968377.2 jmol-1
zpe.correction: 0.368835 hartree
zpe.thermalcorrener: 0.387450 hartree
zpe.thermalcorrenthalpy: 0.388394 hartree
zpe.thermalcorrgfe: 0.322912 hartree
zpe.sumelectzpe: -848.283164 hartree
zpe.sumelectthermal: -848.264549 hartree
zpe.sumelectthermalent: -848.263605 hartree
zpe.sumelectthermalfe: -848.329088 hartree
dipole: 0.9763 1.4177 1.1457
dipole: 2.0678
quadrupole: -119.2661 -119.5716 -117.2054
quadrupole: 16.4350 -11.8796 8.9404
quadrupole: -0.5851 -0.8906 1.4756 16.4350 -11.8796 8.9404
hfenergy: -848.6519996 hartree
pointgroup: C01 [X(C16H24O3)]
dipole: -0.3831839 -0.1790105 0.6949404 debye
polarizability: 254.1848254|3.8823509|136.9685517|0.0727478|-7.6998823|161.4140453 unknown
InChI: InChI=1S/C16H24O3/c1-16(2,11-17)12-7-9-13(10-8-12)19-15-6-4-3-5-14(15)18/h7-10,14-15,17-18H,3-6,11H2,1-2H3
charge 0 multiplicity 1
43 atoms
O  -1.553475 0.237334 -1.086316
O  -3.709268 2.069504 -1.001536
O  4.154936 -2.329832 -0.361384
C  -2.621142 0.053832 -0.065665
C  -3.883888 0.641172 -0.720615
C  -2.815101 -1.42903 0.301708
C  -5.096858 0.492185 0.210986
C  -4.033104 -1.588381 1.2468
C  -5.31225 -0.985978 0.615309
C  4.121526 0.138664 0.192349
C  2.610188 0.191742 -0.134549
C  -0.203119 0.196113 -0.696409
C  4.466976 -1.317511 0.651365
C  5.004247 0.491166 -1.030512
C  4.472126 1.107196 1.35648
C  2.118753 0.30305 -1.464149
C  1.643483 0.065111 0.898949
C  0.737992 0.309748 -1.745995
C  0.256395 0.065528 0.637987
H  -2.375544 0.665823 0.827511
H  -4.05942 0.081386 -1.667097
H  -1.900194 -1.838014 0.768006
H  -2.986737 -2.001351 -0.631157
H  -5.987494 0.900836 -0.299408
H  -4.925193 1.115959 1.110452
H  -3.825235 -1.079164 2.210529
H  -4.184905 -2.659485 1.477488
H  -5.589613 -1.579403 -0.279897
H  -6.159335 -1.061113 1.322703
H  -2.872296 2.162777 -1.527346
H  5.554657 -1.411834 0.814766
H  3.943301 -1.540443 1.606422
H  4.737657 1.477594 -1.451923
H  6.06564 0.529976 -0.723663
H  4.9192 -0.274772 -1.821485
H  4.262849 2.15243 1.066348
H  5.546432 1.029032 1.60976
H  3.896061 0.89113 2.274356
H  2.820188 0.394948 -2.298317
H  1.968789 -0.033806 1.940971
H  0.371328 0.401676 -2.773256
H  -0.442969 -0.029595 1.473454
H  3.190119 -2.255394 -0.582724
