program: Gaussian 09
title: 000183076
version: EM64L-G09RevD.01
frameworkgroup: C1[X(C16H22O4)]
method: RPBEPBE
basis: SDD
operation: Freq
keyword: #pfreq=noraman
keyword: PBEPBE/SDD
title: #p freq=noraman PBEPBE/SDD
converged: YES YES NO NO
title: Mulliken charges:
elementType: O O O O C C C C C C C C C C C C C C C C H H H H H H H H H H H H H H H H H H H H H H
charge: -0.319682 -0.446255 -0.430350 -0.225787 -0.015483 -0.120165 -0.461405 -0.431673 -0.393565 -0.396783 0.391154 0.055570 0.427188 -0.436383 -0.374972 -0.339228 -0.410091 -0.690335 -0.759153 0.169581 0.213109 0.201692 0.235163 0.214632 0.227313 0.209475 0.196718 0.208843 0.198447 0.208937 0.350005 0.249141 0.239957 0.259494 0.248172 0.221305 0.213834 0.242790 0.246132 0.229209 0.216937 0.376511
chargesum: 0.00000
title: Mulliken charges with hydrogens summed into heavy atoms:
elementType: O O O O C C C C C C C C C C C C C C C C
charge: -0.319682 -0.096250 -0.053839 -0.225787 0.197626 0.081528 -0.011610 0.005115 0.011995 0.010600 0.391154 0.055570 0.427188 -0.187242 -0.135015 -0.079734 -0.161919 -0.012405 -0.066874 0.169581
polarizability: 2.57176876e+02 2.66748200e+00 1.61188469e+02 -3.14120752e-01 1.31119674e+01 1.45116720e+02
1716.lowfreq: -9.7296 -4.8042 -0.0005 -0.0004 0.0004 7.9407 24.3427 39.6593 48.9977
frequency: 23.8502 38.8661 48.7890 55.3638 64.4100 90.2029 123.8386 138.1364 171.3136 183.4375 216.7156 221.6774 253.3884 265.7706 286.0634 305.2356 314.5145 342.0391 354.3349 365.1778 387.1207 392.3697 413.8591 419.4681 440.4541 456.1799 476.7304 507.3526 516.6535 540.1782 550.0331 577.0881 606.5738 636.4852 662.3461 706.6023 739.6801 771.7656 785.6092 803.8153 815.2898 837.3464 839.6528 858.0878 886.3675 916.5137 920.6599 943.6363 945.6048 946.6759 967.1331 992.0803 1000.9615 1002.5014 1027.3091 1036.9564 1049.6534 1059.4962 1100.6944 1102.1028 1111.4456 1120.9383 1133.4499 1171.7039 1179.1852 1192.7959 1208.4172 1224.5656 1229.0945 1234.1294 1238.3752 1258.7423 1283.1764 1289.2534 1303.1930 1309.6595 1322.3154 1329.3057 1336.7194 1342.6498 1363.4083 1373.7802 1380.6395 1385.3291 1399.5155 1416.7213 1462.0356 1466.3563 1467.3386 1469.5707 1472.3320 1478.5609 1480.3005 1489.8113 1495.3312 1577.9447 1617.9695 1647.8798 2941.6597 2972.3964 2976.4513 2980.1157 2991.6736 2991.8216 2994.1022 2996.5421 3039.7570 3043.7517 3055.8057 3063.6398 3083.1993 3091.1313 3105.3600 3117.5709 3144.2115 3148.1676 3164.3653 3170.1079 3508.9882 3538.3217
redmass: 4.7532 5.7585 4.7680 5.9424 4.2464 4.8217 3.7820 4.9718 2.7534 3.8131 1.2408 3.6730 2.2966 2.8189 2.0425 1.6969 1.7367 2.7458 3.6936 3.5398 3.4212 3.2094 2.9377 3.1616 1.9043 1.7575 3.3837 3.8943 2.8167 2.5207 3.2873 2.9521 1.4169 6.6753 4.2783 4.1592 4.1915 3.1104 1.8624 3.3273 1.3446 1.6021 1.7587 1.9360 2.1690 1.9996 2.1281 1.5093 1.8735 1.6228 1.3644 3.9142 2.8684 1.5010 2.4654 2.2273 1.4761 1.9029 1.9911 1.7600 1.9573 1.4372 2.1769 2.6950 1.4963 2.1140 1.6457 2.0885 1.3778 2.9392 1.2684 1.2489 2.1528 1.2888 1.2578 1.3362 1.2831 1.4420 1.4265 1.4975 3.3460 1.6464 1.2189 1.7305 1.2022 3.6357 1.0703 1.0891 1.0920 1.0516 1.0820 1.0949 1.0528 1.1085 2.1353 7.0667 6.4119 8.6292 1.0826 1.0658 1.0621 1.0808 1.0620 1.0363 1.0656 1.0360 1.0952 1.0997 1.1022 1.1019 1.1006 1.0996 1.1004 1.0988 1.0874 1.0869 1.0959 1.0959 1.0639 1.0651
irintensity: 0.9649 1.2237 0.1218 0.2439 0.1782 0.1742 1.4892 0.0765 2.1647 1.0282 0.9671 3.4261 0.1079 0.7749 5.6092 4.9516 0.9112 4.1066 1.7960 4.0196 4.0796 11.5748 1.2294 9.8097 70.2194 93.9345 4.1562 7.9992 16.6369 7.0592 5.1501 36.6328 151.2849 0.7868 9.4870 14.3768 6.4641 21.0296 4.6228 0.8585 14.3680 58.3572 2.9666 27.2532 4.9115 9.6196 11.5136 5.3787 2.3290 1.7120 4.0757 133.0599 24.2598 69.9561 72.0427 191.8918 19.6243 2.1704 4.1539 16.5223 12.6479 3.0670 3.4825 8.2652 160.0707 18.4694 43.6043 48.3236 45.3154 81.6223 3.1496 15.7484 11.5507 0.8013 10.0041 1.6812 8.6356 16.6875 1.4867 3.6264 8.0844 15.6967 23.1306 11.9391 18.2500 5.2561 4.7269 7.9547 3.5640 7.4128 21.5290 10.3289 7.5025 55.9078 159.7736 14.9279 64.6178 232.0754 26.9463 25.0894 39.6359 9.4257 6.8757 21.6902 61.7607 28.5697 53.9408 55.8512 26.8080 64.4653 9.4881 60.2143 16.0963 19.1704 4.6151 13.2475 13.5498 6.3323 22.2854 7.3944
temp: 298.150 k
press: 1.00000 atm
elementType: 8 8 8 8 6 6 6 6 6 6 6 6 6 6 6 6 6 6 6 6 1 1 1 1 1 1 1 1 1 1 1 1 1 1 1 1 1 1 1 1 1 1
symmnumber: 1
zpe: 920438.5 jmol-1
zpe.correction: 0.350576 hartree
zpe.thermalcorrener: 0.370426 hartree
zpe.thermalcorrenthalpy: 0.371370 hartree
zpe.thermalcorrgfe: 0.301777 hartree
zpe.sumelectzpe: -922.273994 hartree
zpe.sumelectthermal: -922.254145 hartree
zpe.sumelectthermalent: -922.253201 hartree
zpe.sumelectthermalfe: -922.322794 hartree
dipole: 0.2063 0.7125 -0.2894
dipole: 0.7962
quadrupole: -117.4082 -126.1900 -114.5125
quadrupole: 18.9884 -4.0918 7.4552
quadrupole: 1.9621 -6.8198 4.8577 18.9884 -4.0918 7.4552
hfenergy: -922.6245703 hartree
pointgroup: C01 [X(C16H22O4)]
dipole: -0.0776366 -0.2800703 0.1169092 debye
polarizability: 257.0886074|2.9645837|140.1789275|-2.601371|-8.2383412|166.2145297 unknown
InChI: InChI=1S/C16H22O4/c1-16(2,15(18)19)11-7-9-12(10-8-11)20-14-6-4-3-5-13(14)17/h7-10,13-14,17-18H,3-6H2,1-2H3
charge 0 multiplicity 1
42 atoms
O  -1.771574 0.19061 -1.055368
O  -3.988834 1.948617 -1.093407
O  4.782054 -0.781514 -1.626175
O  4.75867 -1.936112 0.377613
C  -2.859866 0.005275 -0.057082
C  -4.12384 0.526489 -0.763152
C  -3.013807 -1.470357 0.355464
C  -5.352592 0.371094 0.146309
C  -4.249591 -1.640456 1.275294
C  -5.531683 -1.098654 0.596448
C  -0.432781 0.211271 -0.627025
C  3.871904 0.397602 0.327146
C  2.351968 0.318129 0.007082
C  0.533229 0.308197 -1.65909
C  -0.007966 0.154006 0.721174
C  1.901125 0.359267 -1.342575
C  1.372748 0.206408 1.02173
C  4.490601 1.668906 -0.324918
C  4.164308 0.415553 1.847245
C  4.509402 -0.883778 -0.249742
H  -2.658894 0.654893 0.8203
H  -4.258146 -0.07292 -1.69182
H  -2.097774 -1.832318 0.857018
H  -3.142373 -2.078068 -0.561918
H  -6.243719 0.734008 -0.39684
H  -5.220034 1.029969 1.027185
H  -4.081204 -1.097257 2.228203
H  -4.373057 -2.70864 1.534765
H  -5.771812 -1.729491 -0.283843
H  -6.391767 -1.175993 1.287859
H  -3.139784 2.050633 -1.597767
H  0.191269 0.33899 -2.698342
H  -0.726467 0.071591 1.541558
H  2.630755 0.416689 -2.15668
H  1.672043 0.157225 2.072479
H  4.016523 2.565664 0.112149
H  5.577369 1.716566 -0.130319
H  4.34109 1.689149 -1.414927
H  3.822505 -0.508631 2.341369
H  5.251776 0.498122 2.018698
H  3.676793 1.286628 2.31927
H  5.139635 -1.654864 -1.944171
