program: Gaussian 09
title: 000183081
version: EM64L-G09RevD.01
frameworkgroup: C1[X(C16H24O4)]
method: RPBEPBE
basis: SDD
operation: Freq
keyword: #pfreq=noraman
keyword: PBEPBE/SDD
title: #p freq=noraman PBEPBE/SDD
converged: NO YES NO NO
title: Mulliken charges:
elementType: O O O O C C C C C C C C C C C C C C C C H H H H H H H H H H H H H H H H H H H H H H H H
charge: -0.332880 -0.438171 -0.465326 -0.438098 -0.122695 0.169479 -0.415225 -0.439610 -0.399716 -0.385357 0.123677 0.350439 0.435098 -0.347463 -0.748665 -0.718423 -0.432313 -0.384652 -0.392182 -0.384433 0.245013 0.219468 0.216654 0.218051 0.217222 0.214501 0.193559 0.202337 0.222367 0.371159 0.352813 0.209565 0.186129 0.214702 0.213313 0.237944 0.228776 0.210726 0.213591 0.250093 0.299592 0.255466 0.226299 0.347176
chargesum: 0.00000
title: Mulliken charges with hydrogens summed into heavy atoms:
elementType: O O O O C C C C C C C C C C C C C C C C
charge: -0.332880 -0.067012 -0.112513 -0.090922 0.122318 0.169479 0.020897 -0.004337 0.008344 0.039347 0.123677 0.350439 0.435098 0.048231 -0.082706 -0.065330 -0.182221 -0.085061 -0.136716 -0.158134
polarizability: 2.58374694e+02 9.90172498e-01 1.53954674e+02 -4.57836151e+00 1.41495410e+01 1.52797789e+02
1716.lowfreq: -7.6365 -0.0007 -0.0001 0.0002 3.6490 17.4403 23.5474 35.8295 55.3932
frequency: 21.9021 34.1283 55.3827 63.2723 75.6042 102.2723 127.1926 161.4133 181.1530 193.7399 209.8892 223.2978 238.6971 256.3712 280.2685 296.1314 302.2437 314.7175 333.7071 343.3114 355.5941 365.8102 395.7110 402.2060 415.1148 441.3866 449.9575 473.0115 479.2086 500.7855 516.8112 545.3359 567.0772 578.8137 607.6705 635.8413 664.3006 730.7449 740.9109 779.5333 817.8364 834.6641 841.7258 848.4846 852.8989 871.1855 891.0537 917.8627 923.8152 937.3835 953.4355 958.9103 965.7660 968.7583 971.8460 987.3681 1004.9509 1019.5244 1020.3623 1043.8479 1073.9436 1098.3800 1104.7285 1116.9886 1135.6011 1151.7767 1152.3620 1171.6526 1180.8976 1184.1180 1206.0179 1216.8315 1239.3663 1253.1913 1279.2956 1282.0457 1294.6062 1308.4638 1316.6567 1323.0222 1335.2401 1337.2260 1345.2924 1356.4432 1361.8633 1368.5401 1376.2898 1389.3135 1398.2690 1410.8763 1450.8945 1461.1141 1462.5508 1466.5510 1470.4346 1474.2173 1475.5524 1482.7483 1493.0500 1496.5275 1578.6445 1613.4726 2950.8981 2972.6453 2975.8150 2980.2814 2989.3530 2997.4551 3000.7587 3026.2957 3042.7130 3047.1781 3062.1262 3063.4390 3066.9217 3069.3937 3074.8394 3080.4050 3085.4093 3124.9893 3147.9675 3167.6655 3170.7933 3471.7628 3532.6846 3556.7632
redmass: 4.6170 4.4802 3.9615 3.9053 5.4229 4.4222 3.2343 2.5880 4.0392 1.7461 1.7903 2.5683 3.7509 4.8560 2.5226 1.4322 1.3753 1.5186 2.5896 2.1763 2.7011 2.5550 1.6277 3.1182 2.9463 2.9121 3.1489 2.7732 3.1943 2.9750 3.8444 2.6220 2.5201 2.5107 1.4435 6.9055 4.5306 3.3031 3.5111 2.7489 2.3831 1.2732 1.8216 2.3241 2.1842 2.4291 1.8908 2.0340 1.9814 1.4417 1.3343 2.7435 1.4315 1.5017 3.1721 3.2635 3.0092 2.1549 1.6566 1.7403 1.5005 1.9053 1.9429 1.5938 2.2596 1.5092 1.4633 1.5215 2.3683 1.5165 2.7153 2.0494 1.3062 1.3268 1.7823 1.7741 1.2324 1.2989 1.3786 1.2662 1.4382 1.4083 1.4976 1.7631 3.0583 1.3363 1.2427 1.8901 1.2055 3.3432 1.0911 1.0969 1.0778 1.0630 1.0830 1.0700 1.0917 1.0748 1.1694 1.8220 7.1397 6.2325 1.0669 1.0642 1.0351 1.0360 1.0593 1.0625 1.0612 1.0857 1.0961 1.1019 1.1031 1.0966 1.0995 1.1028 1.0981 1.0999 1.0997 1.0887 1.0876 1.0944 1.0957 1.0640 1.0653 1.0651
irintensity: 0.0496 0.2255 0.6369 0.4425 1.4126 1.3859 0.8252 0.3118 0.1543 0.3899 0.5684 0.7074 4.7620 1.4078 14.0321 23.0641 8.8556 45.0615 16.2172 13.4421 5.7801 38.5667 90.2024 23.8611 1.6775 0.8259 6.5736 0.6176 2.0443 24.3828 0.9490 22.7650 7.7094 50.6751 90.4101 2.0336 6.1770 0.0275 5.7123 5.1718 25.1117 2.4119 46.4560 22.1995 7.5589 46.8806 5.5253 15.4512 37.7499 8.2716 3.1823 68.9073 4.3343 16.2470 124.0126 77.5013 26.7528 50.2519 10.8472 33.3284 36.2187 7.2976 16.8189 18.2916 10.9839 38.3439 19.1268 94.2146 1.7930 52.6870 1.4478 164.9987 10.3767 15.6629 86.9635 0.3191 2.1710 0.9601 23.4864 13.4557 2.1493 8.1060 2.2485 13.2768 33.1235 10.7503 30.2353 40.9063 19.5198 2.2992 12.5481 12.1351 2.0199 2.0302 14.2788 15.0253 10.3065 3.4321 84.0729 121.7914 1.5984 55.1270 59.6275 34.8226 31.0968 31.3894 23.9391 36.4855 19.3617 9.4472 54.9702 26.6893 17.1597 9.9290 10.1547 60.3909 116.2093 22.6823 25.4933 19.4405 6.8624 4.6016 7.1213 34.1391 4.8939 8.7944
temp: 298.150 k
press: 1.00000 atm
elementType: 8 8 8 8 6 6 6 6 6 6 6 6 6 6 6 6 6 6 6 6 1 1 1 1 1 1 1 1 1 1 1 1 1 1 1 1 1 1 1 1 1 1 1 1
symmnumber: 1
zpe: 977623.0 jmol-1
zpe.correction: 0.372357 hartree
zpe.thermalcorrener: 0.392856 hartree
zpe.thermalcorrenthalpy: 0.393800 hartree
zpe.thermalcorrgfe: 0.323563 hartree
zpe.sumelectzpe: -923.433661 hartree
zpe.sumelectthermal: -923.413161 hartree
zpe.sumelectthermalent: -923.412217 hartree
zpe.sumelectthermalfe: -923.482454 hartree
dipole: 2.3881 -1.1762 2.5115
dipole: 3.6598
quadrupole: -121.0030 -119.1559 -121.6801
quadrupole: 5.7164 -2.9850 5.5814
quadrupole: -0.3900 1.4571 -1.0671 5.7164 -2.9850 5.5814
hfenergy: -923.8060175 hartree
pointgroup: C01 [X(C16H24O4)]
dipole: 0.852456 -1.1416241 -0.2080729 debye
polarizability: 258.2258189|-4.5943642|147.126678|3.4037646|-12.8613475|159.7746604 unknown
InChI: InChI=1S/C16H24O4/c1-15(2,11-17)12-6-8-13(9-7-12)20-14-5-3-4-10-16(14,18)19/h6-9,14,17-19H,3-5,10-11H2,1-2H3
charge 0 multiplicity 1
44 atoms
O  1.46583 0.633709 -0.48302
O  3.549579 1.391441 1.116876
O  2.151714 -0.169294 2.277447
O  -4.435565 1.992363 1.279974
C  2.433736 -0.431871 -0.103022
C  3.14831 -0.001509 1.204607
C  3.419341 -0.548881 -1.278619
C  4.408836 -0.829835 1.510373
C  4.623291 -1.456913 -0.937773
C  5.370061 -0.920578 0.305199
C  -4.296026 -0.101061 -0.132683
C  0.074727 0.401143 -0.348998
C  -2.762076 0.0740 -0.238897
C  -4.770627 0.567907 1.200234
C  -5.052593 0.559735 -1.311051
C  -4.672541 -1.608562 -0.079167
C  -0.751767 1.063191 -1.282812
C  -0.499971 -0.405199 0.661875
C  -2.152794 0.905525 -1.216308
C  -1.901322 -0.562316 0.698798
H  1.900846 -1.385047 0.070635
H  3.78381 0.467071 -1.523327
H  2.87126 -0.92468 -2.161595
H  4.077186 -1.842541 1.809943
H  4.911362 -0.370974 2.383612
H  5.304549 -1.505988 -1.807581
H  4.274396 -2.492604 -0.744689
H  6.22541 -1.574241 0.560122
H  5.77429 0.086247 0.088022
H  2.795415 1.877063 0.680896
H  2.511505 0.270399 3.090383
H  -5.872159 0.535919 1.264601
H  -4.34807 0.014207 2.06661
H  -4.700161 0.176529 -2.286179
H  -6.13235 0.335936 -1.231492
H  -4.941337 1.658324 -1.293019
H  -4.378163 -2.112802 -1.01707
H  -5.765232 -1.728555 0.048296
H  -4.176421 -2.135601 0.755503
H  -0.287421 1.688117 -2.052234
H  0.135999 -0.852828 1.430649
H  -2.771515 1.428383 -1.951182
H  -2.327178 -1.190295 1.490481
H  -3.451166 2.080564 1.188281
