program: Gaussian 09
title: 000183050
version: EM64L-G09RevD.01
frameworkgroup: C1[X(C11H20O4)]
method: RPBEPBE
basis: SDD
operation: Freq
keyword: #pfreq=noraman
keyword: PBEPBE/SDD
title: #p freq=noraman PBEPBE/SDD
converged: YES YES NO NO
title: Mulliken charges:
elementType: O O O O C C C C C C C C C C C H H H H H H H H H H H H H H H H H H H H
charge: -0.439511 -0.282671 -0.503654 -0.279290 0.320190 -0.227900 -0.380013 -0.165858 -0.735020 -0.765573 0.258269 0.286798 -0.726712 -0.736793 -0.508267 0.281483 0.264003 0.253589 0.214344 0.219600 0.219042 0.264152 0.212646 0.207931 0.345359 0.248286 0.201313 0.218753 0.261480 0.197691 0.220317 0.344886 0.246277 0.229566 0.235290
chargesum: 0.00000
title: Mulliken charges with hydrogens summed into heavy atoms:
elementType: O O O O C C C C C C C C C C C
charge: -0.094152 -0.282671 -0.158769 -0.279290 0.320190 0.053583 -0.116010 0.087730 -0.082034 -0.080844 0.258269 0.286798 -0.058361 -0.057304 0.202865
polarizability: 1.54471990e+02 7.57031053e+00 1.30852749e+02 2.81062945e+00 6.74176874e-01 1.14174440e+02
1716.lowfreq: -0.0006 0.0004 0.0006 5.0869 6.2321 12.6752 37.3626 54.6285 74.1887
frequency: 37.3389 54.5653 74.1632 90.0780 104.0461 129.6518 148.5626 165.2841 183.8977 193.9898 194.9987 225.9265 241.3757 247.8742 260.4446 268.7585 285.4426 298.1652 307.1693 341.0329 352.1406 364.4520 383.6120 430.9589 464.5039 491.7131 512.4849 522.8833 570.3999 658.1202 693.6152 738.5077 759.7081 813.5758 834.9456 892.4887 895.1718 922.9536 925.2947 956.8057 960.5245 973.4865 988.6132 989.5258 1010.0096 1055.0397 1083.0637 1089.0217 1112.7331 1119.0191 1130.1326 1147.8181 1155.6674 1166.5246 1198.9386 1223.1183 1243.0881 1284.0767 1316.6150 1321.8234 1369.5871 1377.4908 1381.6951 1386.4046 1396.4035 1400.0553 1416.0597 1428.5536 1450.4089 1454.3729 1457.8460 1465.0130 1466.3072 1468.1834 1472.4829 1483.8490 1486.7635 1494.8261 1627.2853 2966.1554 2973.8752 2979.4988 2982.7693 3001.3926 3054.4020 3058.6117 3063.3537 3070.9581 3071.9899 3082.1791 3097.2421 3099.8720 3102.2368 3102.7710 3110.9973 3144.0979 3149.6561 3489.0160 3580.8521
redmass: 4.1946 3.7503 3.4390 1.1750 3.5713 4.1765 3.0497 3.1499 1.3946 1.9139 1.9483 1.0989 1.8043 1.4220 1.3731 1.8235 1.8595 3.7433 3.0592 4.9208 2.6303 2.8587 2.9206 3.1423 2.8982 2.1901 3.3703 1.5512 2.8497 4.2709 5.5002 5.3536 5.2068 3.3814 3.2632 2.8315 4.5615 1.4457 2.3822 1.3582 2.5829 2.0882 1.7025 1.5288 1.5125 2.4450 1.4547 1.4604 1.2756 2.1295 1.7248 1.5114 1.7840 2.3566 1.5995 3.3015 1.6000 1.6827 2.0398 2.1394 1.4512 1.2247 1.2397 1.2393 1.2254 1.2409 1.5022 1.6302 1.0504 1.0616 1.0615 1.0519 1.0509 1.0519 1.0521 1.1095 1.0701 1.0845 8.5649 1.0357 1.0382 1.0379 1.0368 1.0294 1.0989 1.0981 1.0972 1.0996 1.0972 1.0866 1.0892 1.0981 1.1043 1.0984 1.0968 1.1046 1.0897 1.0644 1.0663
irintensity: 3.1817 1.0155 2.2463 0.3543 0.5403 0.0200 1.0820 1.8063 1.8308 1.5926 1.9618 0.0891 10.2404 13.9851 53.8907 57.9990 0.8432 11.7572 0.8362 12.2641 0.2042 4.8770 4.2107 3.7720 1.0584 29.5558 0.9023 126.4385 30.7311 1.9893 2.5038 6.4674 51.9695 33.1849 8.5698 24.6320 17.9764 0.9930 5.8279 3.5229 38.0099 18.0637 3.0040 1.5999 30.2072 36.2655 159.7372 75.7628 3.4480 191.6389 47.1737 10.4709 3.6382 55.3600 37.8044 31.5140 19.2395 15.6952 5.9558 50.7768 60.6601 24.0580 51.5162 20.2228 39.5780 17.1670 2.4614 82.2392 13.8616 3.6790 11.4312 11.2903 4.1483 8.2682 1.2014 33.8561 1.6833 15.4761 124.9816 36.0648 25.2539 38.0243 38.1004 40.2931 1.2625 75.5297 12.8330 28.8503 51.5749 2.6064 4.0325 17.6330 27.4735 21.6938 7.1230 19.9146 5.8056 21.4443 3.6229
temp: 298.150 k
press: 1.00000 atm
elementType: 8 8 8 8 6 6 6 6 6 6 6 6 6 6 6 1 1 1 1 1 1 1 1 1 1 1 1 1 1 1 1 1 1 1 1
symmnumber: 1
zpe: 773215.0 jmol-1
zpe.correction: 0.294502 hartree
zpe.thermalcorrener: 0.312870 hartree
zpe.thermalcorrenthalpy: 0.313814 hartree
zpe.thermalcorrgfe: 0.249417 hartree
zpe.sumelectzpe: -730.817045 hartree
zpe.sumelectthermal: -730.798677 hartree
zpe.sumelectthermalent: -730.797733 hartree
zpe.sumelectthermalfe: -730.862131 hartree
dipole: 2.2393 1.6662 -0.3140
dipole: 2.8087
quadrupole: -73.3828 -91.4178 -93.3359
quadrupole: 0.0464 0.2453 1.1498
quadrupole: 12.6627 -5.3723 -7.2904 0.0464 0.2453 1.1498
hfenergy: -731.1115473 hartree
pointgroup: C01 [X(C11H20O4)]
dipole: 0.8319115 -0.7155616 0.1304046 debye
polarizability: 153.0575893|-9.3568055|132.1755857|-3.3117266|0.448571|114.2660046 unknown
InChI: InChI=1S/C11H20O4/c1-10(2)6(7(10)9(13)15-5)8(12)11(3,4)14/h6-8,12,14H,1-5H3
charge 0 multiplicity 1
35 atoms
O  0.853941 1.979682 0.549351
O  -3.126949 0.917861 0.622594
O  3.048603 0.565431 1.234444
O  -1.767255 0.898967 -1.267745
C  -0.384902 -1.621262 0.082324
C  0.350544 -0.415137 0.68049
C  -1.203488 -0.451975 0.721291
C  1.075359 0.674145 -0.102663
C  -0.35731 -2.913517 0.901848
C  -0.454245 -1.865092 -1.424383
C  2.613995 0.422332 -0.1953
C  -1.999321 0.495296 -0.099114
C  2.971761 -0.988161 -0.694754
C  3.285545 1.515124 -1.050287
C  -3.982541 1.909008 -0.070024
H  0.813169 -0.587297 1.661848
H  -1.655259 -0.649667 1.696974
H  0.65294 0.794924 -1.112362
H  0.536089 -3.515428 0.645451
H  -1.251635 -3.530152 0.692707
H  -0.328062 -2.711935 1.988248
H  -0.540785 -0.932057 -2.002096
H  -1.338952 -2.485485 -1.662627
H  0.441751 -2.419541 -1.761731
H  1.419533 1.95812 1.369236
H  2.590831 -1.7556 -0.000878
H  4.06949 -1.10302 -0.773686
H  2.539914 -1.172649 -1.695101
H  2.959953 2.513973 -0.714925
H  4.389382 1.447492 -0.983544
H  3.009896 1.402403 -2.114546
H  4.031139 0.678231 1.262185
H  -3.399133 2.814715 -0.306671
H  -4.788984 2.130441 0.643422
H  -4.384414 1.484931 -1.006075
