program: Gaussian 09
title: 000015581
version: EM64L-G09RevD.01
frameworkgroup: C1[X(C17H21N3O)]
method: RPBEPBE
basis: SDD
operation: Freq
keyword: #p
keyword: freq=noraman
keyword: PBEPBE/SDD
title: #p freq=noraman PBEPBE/SDD
converged: YES YES NO NO
title: Mulliken charges:
elementType: O N N N C C C C C C C C C C C C C C C C C H H H H H H H H H H H H H H H H H H H H H
charge: -0.438753 -0.151738 -0.152757 -0.119350 0.345765 0.341406 -0.030892 0.398695 0.401164 -0.398792 -0.365374 -0.417031 -0.401035 -0.367909 -0.377746 -0.356788 -0.371064 -0.647490 -0.646529 -0.646688 -0.646177 0.253710 0.260055 0.254707 0.256315 0.233622 0.233175 0.232942 0.234117 0.233259 0.233049 0.214826 0.214249 0.234959 0.232754 0.233359 0.234171 0.215109 0.214526 0.234255 0.235186 0.360736
chargesum: 0.00000
title: Mulliken charges with hydrogens summed into heavy atoms:
elementType: O N N N C C C C C C C C C C C C C C C C C
charge: -0.078016 -0.151738 -0.152757 -0.119350 0.345765 0.341406 -0.030892 0.398695 0.401164 -0.145082 -0.105319 -0.162324 -0.144720 -0.134287 -0.144570 -0.123846 -0.136946 0.033645 0.035432 0.035952 0.037790
polarizability: 3.68493563e+02 2.21197365e+00 2.37948384e+02 -1.41416396e+01 2.41158369e-01 1.29849722e+02
1716.lowfreq: -7.4968 -3.0677 -0.0005 -0.0003 0.0006 7.2161 27.9477 34.9529 45.6592
frequency: 27.9389 34.9191 45.6517 54.8597 78.3044 82.4570 93.9276 99.1396 120.2996 134.2791 166.8630 175.5464 199.4969 201.7322 210.6703 226.7730 242.9979 265.0525 279.7905 321.7119 343.5854 365.2517 414.7001 417.4818 424.1702 426.4461 438.5679 469.5761 473.1284 508.6451 513.5177 544.4030 577.7625 623.3610 627.2106 646.0695 657.4116 730.7642 738.8283 750.1581 762.3700 804.1074 808.5314 819.9861 823.3403 858.8259 934.8043 943.2301 944.9539 952.5247 958.5259 963.7123 966.9419 997.8203 1006.0894 1055.7334 1055.9040 1108.9473 1109.8777 1110.0327 1110.4175 1132.9359 1134.9868 1150.9884 1165.8345 1170.5836 1204.3011 1215.8276 1262.5179 1263.2162 1268.3240 1306.4058 1318.3908 1335.3523 1360.5117 1361.4575 1369.3770 1376.9712 1424.7423 1426.5063 1439.2214 1440.9239 1457.8668 1458.8166 1463.4326 1463.4789 1474.3547 1474.4618 1493.1230 1493.8744 1505.0225 1506.0416 1515.2595 1526.6138 1538.1552 1551.1850 1562.3785 1626.5721 1631.6213 2935.5123 2937.1144 2943.9934 2945.4625 3000.0405 3002.1520 3003.2727 3005.3342 3091.0530 3093.4952 3101.9698 3103.4854 3135.9599 3138.6165 3145.5437 3154.9626 3162.8078 3164.9771 3168.8318 3184.1896 3561.6442
redmass: 3.4232 4.3526 2.9413 4.6087 2.4592 3.0478 2.2688 2.1180 1.9709 2.8366 2.4674 3.2381 1.2166 1.1920 2.6142 3.1078 3.5764 3.4159 3.6635 4.0903 4.7790 4.6543 3.3156 3.2500 1.2724 2.8910 3.2801 3.6403 3.4895 3.1923 2.8773 2.7728 4.1543 5.7006 5.5769 5.4571 4.1393 4.5151 4.2338 4.3424 5.6342 1.2615 1.2627 1.8491 1.9214 8.2955 3.0131 3.0527 2.2514 1.3546 1.6381 1.8599 1.3358 3.1808 2.5887 1.4928 1.4880 1.2482 1.2529 1.3091 1.3038 1.4645 1.5524 2.4295 1.6875 1.6382 1.1301 1.1546 2.8531 2.8599 1.5118 2.0846 1.4431 1.7380 3.4615 3.1039 4.9431 5.3852 1.6998 1.4795 1.8061 2.0706 1.2118 1.2267 1.0434 1.0414 1.0466 1.0468 1.1059 1.0906 1.2787 1.1468 2.3319 2.4368 3.9404 6.4224 7.2098 5.9721 6.2342 1.0367 1.0369 1.0394 1.0395 1.0993 1.0993 1.1026 1.1024 1.0962 1.0960 1.0940 1.0940 1.0880 1.0873 1.0868 1.0876 1.0944 1.0942 1.0958 1.0955 1.0672
irintensity: 0.9218 1.7001 0.0889 2.9417 0.1190 0.4471 1.4342 4.6898 0.5365 0.6137 0.4115 0.2666 0.0835 0.0174 0.6483 1.0220 1.1432 2.7573 10.4042 4.4534 9.2989 4.6973 2.8764 0.5754 103.0339 8.2138 7.0671 5.0652 5.3317 3.2708 7.4172 11.4169 22.7952 7.5677 1.8837 1.1279 22.5820 18.1586 0.5371 18.8967 3.4029 6.6909 5.2667 75.8204 90.0346 143.7642 33.3526 6.3494 21.7015 0.2881 4.4546 7.5599 0.1900 1.7320 0.8672 25.9636 25.7780 0.2719 0.3911 1.6099 0.9305 2.9743 3.9755 47.1779 16.7713 8.2237 151.8962 21.3471 37.1232 30.7810 105.2731 30.8253 11.7050 23.1649 222.0130 138.9436 1.4645 38.6234 9.3599 6.0180 0.3553 5.0536 10.1872 15.7107 0.7164 0.0883 21.1778 20.8577 1.1111 3.0655 10.6934 26.7388 281.1644 117.9262 123.6724 3.5666 22.8183 520.4594 127.1749 110.9349 107.8753 169.0809 83.4679 10.3319 9.5832 83.4684 81.9460 4.5319 4.2412 54.7017 50.9074 20.1032 2.8813 8.7490 15.9553 23.0869 20.4513 11.3647 7.3201 49.9170
temp: 298.150 k
press: 1.00000 atm
elementType: 8 7 7 7 6 6 6 6 6 6 6 6 6 6 6 6 6 6 6 6 6 1 1 1 1 1 1 1 1 1 1 1 1 1 1 1 1 1 1 1 1 1
symmnumber: 1
zpe: 907380.5 jmol-1
zpe.correction: 0.345603 hartree
zpe.thermalcorrener: 0.367073 hartree
zpe.thermalcorrenthalpy: 0.368017 hartree
zpe.thermalcorrgfe: 0.294285 hartree
zpe.sumelectzpe: -898.277745 hartree
zpe.sumelectthermal: -898.256275 hartree
zpe.sumelectthermalent: -898.255331 hartree
zpe.sumelectthermalfe: -898.329063 hartree
dipole: 0.0188 -3.8426 0.0284
dipole: 3.8428
quadrupole: -75.1717 -111.8267 -126.7197
quadrupole: -0.6351 -3.7390 0.1071
quadrupole: 29.4010 -7.2540 -22.1470 -0.6351 -3.7390 0.1071
hfenergy: -898.6233482 hartree
pointgroup: C01 [X(C17H21N3O1)]
dipole: -0.0331035 1.4095102 0.5458277 debye
polarizability: 367.2620467|-3.5492801|224.4858382|21.7447467|35.6278861|144.5437837 unknown
InChI: InChI=1S/C17H21N3O/c1-19(2)15-9-5-13(6-10-15)17(18-21)14-7-11-16(12-8-14)20(3)4/h5-12,21H,1-4H3
charge 0 multiplicity 1
42 atoms
O  -1.039071 -3.404016 -1.410153
N  5.053428 1.23339 0.375226
N  -4.944619 1.293476 0.257688
N  0.232266 -2.687602 -1.179682
C  1.329592 -0.750787 -0.397828
C  -1.250858 -0.76283 -0.48109
C  0.048789 -1.452541 -0.709848
C  3.838879 0.586234 0.120839
C  -3.740664 0.62263 0.019233
C  1.462293 0.657037 -0.545112
C  -2.375426 -0.925073 -1.33873
C  2.483338 -1.474028 0.012828
C  -1.410272 0.104209 0.63714
C  2.679118 1.315218 -0.294712
C  -3.581975 -0.245723 -1.10839
C  3.705161 -0.832558 0.269477
C  -2.617262 0.775154 0.893617
C  5.157975 2.687787 0.213551
C  6.231665 0.455656 0.775716
C  -5.085493 2.153083 1.438921
C  -6.085548 1.10035 -0.645639
H  0.600822 1.245683 -0.878678
H  -2.296823 -1.595275 -2.197673
H  2.404007 -2.559312 0.131212
H  -0.571568 0.241797 1.328358
H  2.72725 2.399075 -0.433362
H  -4.410994 -0.400608 -1.804561
H  4.557811 -1.436512 0.593029
H  -2.686225 1.415798 1.777072
H  4.948363 3.005068 -0.828992
H  4.454122 3.227456 0.879944
H  6.17928 3.013276 0.467519
H  7.088839 1.133592 0.91394
H  6.512039 -0.294703 0.008134
H  6.065971 -0.082749 1.731439
H  -4.350177 2.983372 1.433027
H  -4.949682 1.586132 2.38317
H  -6.093938 2.596028 1.451955
H  -6.932701 1.71531 -0.302693
H  -5.843132 1.405256 -1.683942
H  -6.419648 0.042567 -0.671617
H  -0.703233 -4.292115 -1.695536
