program: Gaussian 09
title: 000183049
version: EM64L-G09RevD.01
frameworkgroup: C1[X(C22H14O)]
method: RPBEPBE
basis: SDD
operation: Freq
keyword: #pfreq=noraman
keyword: PBEPBE/SDD
title: #p freq=noraman PBEPBE/SDD
converged: NO YES NO NO
title: Mulliken charges:
elementType: O C C C C C C C C C C C C C C C C C C C C C C H H H H H H H H H H H H H H
charge: -0.212802 -0.348870 -0.345463 0.386520 0.333146 0.218185 0.178912 -0.725129 -0.574564 0.471052 0.232838 -0.432222 -0.380370 0.191744 -0.231570 -0.252512 -0.498749 0.420854 -0.478468 -0.369484 -0.433688 -0.261238 -0.248838 0.255445 0.255639 0.264389 0.225411 0.258108 0.234161 0.231721 0.245392 0.229292 0.237647 0.222413 0.241343 0.228793 0.230966
chargesum: 0.00000
title: Mulliken charges with hydrogens summed into heavy atoms:
elementType: O C C C C C C C C C C C C C C C C C C C C C C
charge: -0.212802 -0.093425 -0.089824 0.386520 0.333146 0.218185 0.178912 -0.460740 -0.349152 0.471052 0.232838 -0.174115 -0.146209 0.191744 0.000150 -0.023220 -0.253357 0.420854 -0.240821 -0.147071 -0.192345 -0.032446 -0.017872
polarizability: 4.28758198e+02 -2.95128211e+00 2.72825417e+02 -1.71286521e+00 3.32456655e-01 1.02557738e+02
1716.lowfreq: -0.0006 -0.0005 -0.0003 2.2640 5.3769 7.4197 44.5725 54.5289 96.1658
frequency: 44.5698 54.5282 96.1622 110.7404 140.5032 155.8304 192.1409 224.2564 234.9848 274.1047 281.9765 329.3576 369.6151 396.7235 403.0577 414.9522 437.0152 443.9688 461.0071 502.1247 516.3803 533.3315 547.6602 566.3188 584.9690 593.4212 612.9730 648.5811 681.7535 707.5589 708.1782 727.7940 744.2056 758.2643 766.0634 778.9412 796.0059 804.9227 827.0637 835.2383 846.5009 867.5362 885.0378 886.0187 903.6962 920.7393 949.5662 957.9190 960.2256 983.8022 986.2554 990.2980 993.1839 1028.3296 1035.1680 1042.6120 1079.1101 1093.3501 1104.5214 1123.2717 1160.3864 1170.4590 1178.6214 1183.3531 1203.9497 1224.5603 1232.0574 1242.7086 1267.9904 1283.1846 1287.5802 1300.0361 1330.9353 1347.2661 1369.7449 1380.9332 1388.4902 1402.5659 1425.7581 1440.2126 1441.1244 1458.1515 1468.8656 1487.1281 1513.1315 1563.5769 1567.5306 1612.0630 1612.2614 1625.0623 1640.8659 3055.7060 3063.7146 3121.3290 3123.2417 3126.9834 3132.7606 3138.1389 3139.4115 3145.8476 3147.1121 3150.4502 3155.8786 3165.6163 3166.5073
redmass: 5.0704 5.0672 5.0640 4.4744 4.4191 5.2912 4.6841 5.8331 6.0280 4.9396 5.1176 5.3403 3.7408 4.7884 3.6292 3.5954 5.0597 3.2822 5.0429 5.7931 5.3941 3.2268 3.9354 3.5219 5.0789 6.9170 4.7605 6.0490 4.7743 3.3447 5.4961 4.5073 3.6634 1.3132 2.8812 1.9403 3.7971 2.3462 3.4839 1.7285 5.4372 4.1600 1.6931 1.4950 1.8668 1.6116 1.7073 1.4318 2.4782 1.3803 7.8282 1.3365 1.3795 1.3673 2.1601 2.1788 3.1816 1.4104 2.1648 2.2588 1.3545 1.3703 1.0943 1.9483 2.1463 1.8855 2.2771 1.7412 1.8187 1.5808 1.6089 1.8851 1.1753 2.5868 2.3421 3.9074 2.2691 4.5495 2.7487 2.4627 4.9258 3.1896 3.4032 3.8594 3.7864 5.2381 6.8427 6.5103 6.2908 6.5754 7.6700 1.0863 1.0844 1.0863 1.0861 1.0854 1.0884 1.0893 1.0924 1.0971 1.0945 1.0945 1.0903 1.0993 1.1002
irintensity: 0.5411 0.2274 0.4934 0.4645 0.7241 1.7301 1.1042 1.9225 1.0198 1.8629 1.3542 2.3129 4.4104 0.4929 3.6877 1.7118 1.4813 23.7939 1.6410 1.9043 0.6925 0.6326 0.3256 2.2521 12.0440 5.7629 4.3225 0.9986 3.0747 9.6170 2.1572 3.3561 26.2988 76.3432 21.6947 23.9621 3.0101 0.7155 30.3005 49.2945 11.9289 1.7595 1.4337 0.3415 24.1150 23.6120 0.4339 7.2963 2.1703 0.0583 0.6819 0.2038 0.1492 46.5465 5.0755 9.0025 1.0314 1.8719 1.3533 6.6323 0.9419 0.7188 1.6052 0.3482 1.4295 3.8161 0.6429 17.5856 4.6612 4.2433 0.5319 0.4049 9.8382 2.5523 36.1011 14.4638 18.7859 2.8842 5.1513 15.2784 0.6027 6.1637 15.7030 0.6846 10.7189 0.5131 0.6731 2.5965 1.7246 0.9803 4.6189 1.1561 17.1205 0.6293 3.2951 3.6728 5.2011 4.6826 3.9331 14.7304 37.2215 24.4785 13.7767 32.1903 36.8071
temp: 298.150 k
press: 1.00000 atm
elementType: 8 6 6 6 6 6 6 6 6 6 6 6 6 6 6 6 6 6 6 6 6 6 6 1 1 1 1 1 1 1 1 1 1 1 1 1 1
symmnumber: 1
zpe: 751180.9 jmol-1
zpe.correction: 0.286110 hartree
zpe.thermalcorrener: 0.302146 hartree
zpe.thermalcorrenthalpy: 0.303090 hartree
zpe.thermalcorrgfe: 0.242958 hartree
zpe.sumelectzpe: -920.376077 hartree
zpe.sumelectthermal: -920.360041 hartree
zpe.sumelectthermalent: -920.359097 hartree
zpe.sumelectthermalfe: -920.419229 hartree
dipole: 1.9141 2.6958 -0.3284
dipole: 3.3225
quadrupole: -119.4633 -123.1972 -138.0844
quadrupole: -13.0687 0.6466 0.8634
quadrupole: 7.4517 3.7178 -11.1695 -13.0687 0.6466 0.8634
hfenergy: -920.662187 hartree
pointgroup: C01 [X(C22H14O1)]
dipole: -0.7476604 1.0641288 0.1316243 debye
polarizability: 428.7682074|2.2198725|272.8012226|-2.7524912|-0.3232124|102.5719232 unknown
InChI: InChI=1S/C22H14O/c1-2-6-15-13(5-1)9-10-14-11-20-19(12-18(14)15)16-7-3-4-8-17(16)21-22(20)23-21/h1-12,21-22H
charge 0 multiplicity 1
37 atoms
O  3.629459 -2.77046 -0.316592
C  2.549426 -1.957824 0.387887
C  3.321269 -1.332547 -0.725009
C  1.113814 -1.56316 0.222721
C  3.648519 0.073621 -0.315323
C  1.098563 -0.100024 0.1103
C  2.392093 0.694928 0.075902
C  -0.068167 -2.290849 0.257369
C  -0.157854 0.528313 0.033252
C  -1.337178 -1.636415 0.167017
C  -1.3878 -0.197159 0.058844
C  4.84714 0.803601 -0.358993
C  2.432057 2.071244 0.420569
C  -2.694114 0.464089 -0.029939
C  4.850364 2.173053 0.001564
C  3.642573 2.799678 0.385336
C  -2.559862 -2.402288 0.184774
C  -3.893343 -0.342019 -0.005775
C  -3.791147 -1.77901 0.10309
C  -2.845291 1.881128 -0.138339
C  -5.174193 0.287244 -0.090035
C  -4.111191 2.478499 -0.220687
C  -5.289139 1.677908 -0.196627
H  2.93244 -1.724102 1.39352
H  2.827704 -1.380756 -1.708109
H  -0.03192 -3.382309 0.343607
H  -0.188408 1.614655 -0.089592
H  5.772058 0.301802 -0.6613
H  1.520818 2.576262 0.759298
H  5.785158 2.743963 -0.013137
H  -2.491945 -3.493393 0.265142
H  3.644137 3.85727 0.671391
H  -4.715686 -2.368038 0.119221
H  -1.963169 2.528423 -0.158593
H  -6.071887 -0.342378 -0.070019
H  -4.1941 3.567796 -0.303339
H  -6.275298 2.150159 -0.260796
