program: Gaussian 09
title: 000183034
version: EM64L-G09RevD.01
frameworkgroup: C1[X(C9H10N2O3)]
method: RPBEPBE
basis: SDD
operation: Freq
keyword: #p
keyword: freq=noraman
keyword: PBEPBE/SDD
title: #p freq=noraman PBEPBE/SDD
converged: YES YES NO NO
title: Mulliken charges:
elementType: O O O N N C C C C C C C C C H H H H H H H H H H
charge: -0.269630 -0.244921 -0.299078 -0.614915 0.002185 -0.089829 -0.703456 0.217823 0.217191 0.231330 -0.258797 -0.412442 -0.177316 -0.312963 0.258066 0.221851 0.255787 0.227590 0.278706 0.284079 0.240587 0.367024 0.330667 0.250461
chargesum: 0.00000
title: Mulliken charges with hydrogens summed into heavy atoms:
elementType: O O O N N C C C C C C C C C
charge: -0.269630 -0.244921 -0.299078 0.082776 0.002185 0.168237 0.001772 0.217823 0.217191 0.231330 0.019909 -0.128363 0.063271 -0.062502
polarizability: 1.74414478e+02 -6.30169434e+00 1.18150756e+02 2.73411027e+00 9.23591500e+00 7.13293226e+01
1716.lowfreq: -0.0005 -0.0004 0.0003 3.1246 4.8499 12.4347 40.0925 44.9871 68.7988
frequency: 40.0734 44.9641 68.7964 101.9786 134.5133 158.9257 184.4217 225.7506 266.1692 284.5293 308.8306 361.4032 377.0118 430.0401 452.3132 483.4004 566.6892 608.0535 615.2801 678.5895 692.1406 703.6792 717.4053 730.6983 785.8967 797.0516 832.7224 841.1476 941.2731 967.9236 998.0548 1005.5492 1011.4160 1022.0467 1061.8465 1082.3955 1099.2178 1107.8466 1155.3647 1197.3572 1251.1676 1275.1501 1311.3491 1317.5617 1329.0337 1358.0079 1398.8745 1407.8227 1455.2951 1458.1150 1464.4582 1545.8628 1573.8639 1584.8111 1613.8907 1653.9469 3009.6032 3023.2917 3106.7479 3124.5964 3138.1524 3156.2624 3165.6803 3176.5808 3426.8935 3625.8317
redmass: 4.5414 7.3265 6.3641 4.8096 6.0848 4.7251 1.0882 4.2168 4.7208 4.8562 4.0705 4.9435 3.0985 4.7945 4.8685 3.6916 3.3069 5.8809 1.5778 5.0136 3.2862 3.8529 1.8542 1.4233 3.5627 4.0879 1.7312 4.8536 1.3724 1.5008 3.8751 1.3836 1.7036 4.3736 1.6849 3.2373 2.0440 1.5985 2.4451 1.3211 2.3445 1.7009 5.3922 1.6871 1.2490 2.8633 1.2411 2.1399 2.0210 1.0721 1.0559 5.7434 2.9310 5.4321 1.9018 5.7190 1.0368 1.0846 1.0993 1.1008 1.0889 1.0914 1.0928 1.1004 1.0523 1.0990
irintensity: 0.5299 2.0827 6.1165 0.9294 3.0039 0.3127 0.5417 12.7620 10.2157 10.5628 2.7885 2.5476 1.6565 4.6224 2.9758 13.1739 17.6478 3.3615 88.1034 6.4487 75.1208 84.8720 48.0045 107.0002 0.7848 1.6280 20.3503 22.0216 1.3538 2.0584 46.1716 0.5152 35.9737 6.1169 134.8280 131.0864 2.0450 10.8987 7.4822 5.6958 240.0960 72.9331 6.4997 32.0690 2.2841 34.6133 31.5931 30.2010 19.4909 8.1325 11.0339 20.1290 230.8141 58.3761 38.3732 299.1295 9.2826 11.4888 16.6425 11.5186 9.2833 7.0451 4.8571 15.6772 96.0008 73.9368
temp: 298.150 k
press: 1.00000 atm
elementType: 8 8 8 7 7 6 6 6 6 6 6 6 6 6 1 1 1 1 1 1 1 1 1 1
symmnumber: 1
zpe: 479078.2 jmol-1
zpe.correction: 0.182471 hartree
zpe.thermalcorrener: 0.195539 hartree
zpe.thermalcorrenthalpy: 0.196484 hartree
zpe.thermalcorrgfe: 0.141826 hartree
zpe.sumelectzpe: -683.123217 hartree
zpe.sumelectthermal: -683.110149 hartree
zpe.sumelectthermalent: -683.109204 hartree
zpe.sumelectthermalfe: -683.163861 hartree
dipole: -2.3182 2.9652 1.9516
dipole: 4.2397
quadrupole: -81.0913 -80.1925 -83.9150
quadrupole: -2.9441 5.8018 -6.8875
quadrupole: 0.6417 1.5404 -2.1821 -2.9441 5.8018 -6.8875
hfenergy: -683.3056879 hartree
pointgroup: C01 [X(C9H10N2O3)]
dipole: 0.8064897 1.0929988 -0.9681088 debye
dipolederiv: -1.3460078 -0.4555872 0.0013703 -0.6840384 -0.7680748 0.0378252 0.1530803 0.0860222 -0.3439313 -0.6943093 -0.2425582 0.2524188 -0.0948666 -0.6793043 0.02261 0.4288093 0.255623 -0.6108304 -0.9050581 0.1818975 -0.1408371 0.0703575 -0.7792115 0.209797 -0.037139 0.2651721 -0.5072521 -0.6372204 0.0427905 -0.1459776 -0.0557464 -1.0386493 0.1507745 -0.0959696 0.0266236 -0.4742524 -0.5333009 -0.0887662 -0.0062872 -0.0845821 -0.3025509 0.0093305 -0.0134701 0.0096224 -0.2544952 0.7287595 0.2757275 0.1515881 0.2680693 0.3411737 0.024037 0.2971491 0.0663278 0.2463561 -0.0712739 -0.06152 -0.0067517 -0.0696253 -0.1162165 -0.0219112 -0.0386808 -0.0458285 0.0406481 0.6461336 0.182135 -0.4350382 0.0744678 1.2697248 -0.1267583 -0.6735307 -0.2688986 0.5677002 -0.6032868 0.0250808 -0.1444268 -0.0838436 -0.1690082 0.0747496 -0.1147196 0.1017543 -0.0368379 1.9057399 0.1289491 0.2309791 0.5216916 1.111824 -0.3241318 0.0277941 -0.4341443 0.4605096 0.1906904 -0.0777013 0.0950878 0.1584835 0.0632868 -0.0449304 -0.0149751 -0.0863977 -0.035308 0.2482867 0.046748 0.0349774 -0.0174022 0.1673158 -0.0937507 0.0503695 -0.0881698 0.0328327 -0.2003744 0.1606002 -0.0982374 0.2930122 -0.066506 0.0336587 -0.1603467 0.0108961 -0.143984 0.3551699 0.0528323 0.0587318 -0.0996153 0.1590411 -0.1260757 0.1350878 -0.0961477 0.024856 -0.0313839 -0.0295377 0.0305322 0.0228394 0.0017065 0.0989316 -0.0354236 0.0193133 -0.0414995 0.0395317 0.0959955 0.1042788 0.0552483 0.0242192 -0.0667832 0.0937292 -0.0649577 0.0102649 0.1251218 0.0036209 -0.0233902 -0.0014216 0.0752526 0.0326821 -0.0167107 0.0930991 -0.0373532 -0.090598 -0.0301281 -0.0792991 -0.0219014 0.0774083 0.0080986 -0.0675683 0.0077654 0.087719 0.1335139 0.0553755 -0.0341611 0.0268402 0.0460418 0.0542473 -0.0192414 0.0599829 0.1119187 0.0647498 -0.0569888 0.0150562 -0.0897272 0.0547353 0.0207465 0.0376662 0.0243081 0.122069 -0.0041377 -0.0886328 0.0130008 -0.1105124 0.0125742 0.0537264 0.0220308 0.0571243 0.1365875 0.5087919 -0.0966667 0.0565648 -0.0673367 0.2253828 -0.0137652 -0.028518 0.0001824 0.289303 0.274871 -0.0104256 0.1108257 -0.016983 0.187244 -0.0318342 0.1257503 -0.014273 0.2370411 -0.104409 -0.0132402 -0.0410053 0.0065926 0.1025905 0.0187256 -0.055173 0.0150001 0.1179382 unknown
polarizability: 172.5082323|12.5525889|115.2220974|3.0773669|-16.7716209|76.1642275 unknown
InChI: InChI=1S/C9H10N2O3/c1-6(8(10)12)14-9(13)7-3-2-4-11-5-7/h2-6H,10H2,1H3
charge 0 multiplicity 1
24 atoms
O  -0.981618 -0.759468 -0.171845
O  -4.047662 -0.583699 1.275637
O  -0.705924 1.344237 -1.146772
N  -3.16384 1.367162 0.353778
N  3.027053 -1.092584 0.840138
C  -2.435674 -0.791118 -0.589522
C  -2.822816 -2.260065 -0.66153
C  -3.290039 -0.002043 0.447978
C  1.211271 0.19212 -0.184709
C  -0.22299 0.338234 -0.552593
C  2.112754 1.233091 -0.525713
C  1.714877 -0.948289 0.497931
C  3.470787 1.094649 -0.177734
C  3.880517 -0.078825 0.500273
H  -2.494209 -0.285308 -1.572109
H  -2.147607 -2.802371 -1.344294
H  -2.7883 -2.717228 0.339823
H  -3.85794 -2.352038 -1.033208
H  1.734986 2.115859 -1.051354
H  1.043867 -1.765436 0.778215
H  4.200225 1.872322 -0.422538
H  -2.490147 1.78144 -0.300482
H  -3.682129 1.951302 1.00996
H  4.927957 -0.224745 0.787671
