program: Gaussian 09
title: 000183018
version: EM64L-G09RevD.01
frameworkgroup: C1[X(C12H3Br4ClO2)]
method: RPBEPBE
basis: SDD
operation: Freq
keyword: #p
keyword: freq=noraman
keyword: PBEPBE/SDD
title: #p freq=noraman PBEPBE/SDD
converged: NO NO NO NO
title: Mulliken charges:
elementType: Br Br Br Br Cl O O C C C C C C C C C C C C H H H
charge: 0.112955 0.087324 0.081622 0.080538 0.051467 -0.249725 -0.266622 0.421230 0.289420 0.271605 0.261151 -0.276950 -0.352256 -0.312908 -0.310901 -0.206602 -0.192517 -0.181842 -0.180357 0.291881 0.292229 0.289259
chargesum: 0.00000
title: Mulliken charges with hydrogens summed into heavy atoms:
elementType: Br Br Br Br Cl O O C C C C C C C C C C C C
charge: 0.112955 0.087324 0.081622 0.080538 0.051467 -0.249725 -0.266622 0.421230 0.289420 0.271605 0.261151 -0.276950 -0.060376 -0.020678 -0.021643 -0.206602 -0.192517 -0.181842 -0.180357
polarizability: 4.01031005e+02 3.43818462e+00 2.22729525e+02 -7.31746985e-04 3.31093873e-03 7.11378433e+01
1716.lowfreq: -0.0020 -0.0016 -0.0016 2.3417 2.4525 4.6320 20.4917 28.4517 58.3678
frequency: 20.4881 28.4508 58.3675 74.5959 106.8236 113.0123 128.1884 129.9898 155.8838 156.9573 165.1649 181.5096 224.7013 237.8472 278.6336 281.5426 336.0445 351.8215 363.1871 379.5932 444.0851 459.7826 509.1232 521.6546 536.7752 575.3431 586.8797 594.8094 602.6265 661.5454 679.5264 695.4818 736.6041 776.5604 840.0391 851.3617 859.7611 879.1642 882.7306 918.3835 1089.2219 1099.7212 1108.6654 1144.9910 1213.8760 1226.0864 1270.3607 1326.2873 1345.2372 1357.6223 1364.6738 1424.7045 1459.8616 1549.9732 1565.9053 1583.9465 1621.1653 3180.2507 3182.7016 3186.0828
redmass: 18.2605 46.2453 30.7091 24.9151 8.9958 72.0273 58.9950 10.0295 29.6739 10.7196 43.6971 40.0389 6.6041 28.9170 17.0775 7.7086 15.1372 12.1549 12.2355 10.8344 3.0956 8.7689 8.0124 4.5892 8.1417 11.6847 10.9644 12.1498 9.9686 4.2244 9.2207 7.4995 8.1601 9.1164 8.1378 1.4119 1.4017 1.3873 9.5901 12.1506 1.8234 6.7730 7.8150 2.3516 3.6564 1.2766 3.9533 9.7432 9.0958 8.5244 6.7842 5.1700 3.9254 10.9442 8.3440 10.6745 8.8564 1.0922 1.0931 1.0928
irintensity: 0.0027 0.0059 0.0138 0.0268 0.0417 0.0279 0.3791 0.1165 0.0660 0.0964 0.0195 0.0303 0.5388 0.1757 0.2893 0.9911 10.2674 1.0808 7.2267 0.6663 10.1512 6.6461 0.1223 1.9890 0.2144 0.0070 0.1725 0.0003 3.9487 0.0715 22.6338 1.9216 12.2985 91.9417 78.7366 0.2767 21.4124 54.4334 116.7881 45.4091 87.4566 41.2254 2.4458 42.7550 6.7801 2.0687 306.5176 15.3124 85.1711 136.8361 0.0649 804.7644 404.3679 64.7292 13.6361 10.1646 13.7319 2.5728 1.7887 2.7923
temp: 298.150 k
press: 1.00000 atm
elementType: 35 35 35 35 17 8 8 6 6 6 6 6 6 6 6 6 6 6 6 1 1 1
symmnumber: 1
zpe: 297190.5 jmol-1
zpe.correction: 0.113194 hartree
zpe.thermalcorrener: 0.130928 hartree
zpe.thermalcorrenthalpy: 0.131873 hartree
zpe.thermalcorrgfe: 0.062949 hartree
zpe.sumelectzpe: -1122.068610 hartree
zpe.sumelectthermal: -1122.050875 hartree
zpe.sumelectthermalent: -1122.049931 hartree
zpe.sumelectthermalfe: -1122.118854 hartree
dipole: 0.1004 -1.1698 -0.0001
dipole: 1.1741
quadrupole: -158.9066 -146.8492 -154.8528
quadrupole: 2.1285 0.0002 0.0000
quadrupole: -5.3704 6.6870 -1.3166 2.1285 0.0002 0.0000
hfenergy: -1122.1818036 hartree
pointgroup: C01 [X(C12H3Br4Cl1O2)]
dipole: 0.0464607 0.4595658 0.0000387 debye
dipolederiv: -0.4792117 -0.2480282 0.0000203 -0.3114685 -0.0526589 0.0000154 0.0001023 0.0000084 0.0504996 -0.439843 0.2982173 0.0000289 0.3796668 -0.2249182 -0.0000253 0.0000351 -0.0000209 0.0232015 -0.4639129 0.2762063 -0.0000174 0.3828405 -0.1965717 0.000022 0.0000391 -0.0000002 0.0212706 -0.5178606 -0.2643126 -0.0000301 -0.3597546 -0.1547048 -0.0000237 0.0000938 -0.0000556 0.020336 -0.0117945 0.0363018 0.0000019 -0.0396074 -0.6118234 -0.0000266 0.0000159 -0.0000237 0.0077198 -2.4126403 0.0364783 -0.0000021 0.0923532 -0.2843933 -0.0000309 0.0001631 -0.0001142 -0.125561 -2.4211517 0.011753 -0.0000005 0.0673578 -0.3842663 0.0000237 -0.0000672 0.0000778 -0.1413513 1.3053454 -0.1935094 -0.0000679 -1.1450759 -0.140856 0.0000099 -0.0004965 0.0001258 0.108114 1.5203755 0.1151974 -0.0000663 0.9738659 0.2378138 -0.0000078 0.0003897 -0.0001515 0.082164 1.4979193 0.1447374 0.0000796 0.9842213 0.1191156 0.0000223 0.0003089 -0.000017 0.075173 1.3806006 -0.174916 0.0000618 -1.0879236 0.1646022 -0.0000218 -0.0000844 0.0000158 0.0771012 -0.2696138 -0.0459954 -0.0000006 -0.0637536 0.9121255 0.0000574 0.0001926 -0.0000145 -0.0476607 -0.5427181 0.1228195 0.0000081 0.1578573 -0.1269633 -0.0000187 -0.0000821 0.0000221 -0.1019722 -0.4740108 0.1158304 -0.0000108 0.1377162 -0.0895001 0.000018 -0.0001057 0.0000388 -0.0811374 -0.4975456 -0.0921406 -0.0000126 -0.1102272 -0.0659854 -0.000016 -0.0000731 0.0000003 -0.0861315 0.5999435 0.6113868 -0.0000293 0.6485206 -0.135434 -0.0000445 -0.0004129 0.0000464 -0.0888412 0.6150152 -0.6845959 -0.0000504 -0.6498612 0.4055719 0.000051 0.0001023 0.0000035 -0.0990899 0.6012261 -0.7370641 0.0000333 -0.6972918 0.3050332 -0.0000395 -0.0001113 -0.000007 -0.1115925 0.7183129 0.7088277 0.0000636 0.6660243 0.2125173 0.000048 0.0000749 0.0000588 -0.1109329 0.0962123 -0.0305813 0.0000071 -0.0205764 0.0412982 -0.000004 -0.0000268 0.0000036 0.1777405 0.0970695 -0.0356581 -0.0000091 -0.0198487 0.0393131 -0.000008 -0.0000129 -0.0000031 0.175159 0.0982824 0.0290458 -0.0000074 0.014965 0.0306848 -0.0000007 -0.0000447 0.0000065 0.1757913 unknown
polarizability: 400.8858452|-6.1385886|222.8746844|0.0007818|0.0032995|71.1378433 unknown
InChI: InChI=1S/C12H3Br4ClO2/c13-4-1-7-8(2-5(4)14)19-12-9(18-7)3-6(15)10(16)11(12)17/h1-3H
charge 0 multiplicity 1
22 atoms
Br -5.257648 -1.305125 0.000187
Br -5.051722 2.151193 0.000245
Br 5.332224 -1.811289 0.00017
Br 5.478119 1.681546 0.000243
Cl -2.361624 -2.944796 -0.00009
O  0.069461 -1.305812 -0.00031
O  0.190341 1.614177 -0.000229
C  -1.094489 -0.503324 -0.000137
C  -1.03929 0.910634 -0.000107
C  1.301136 -0.600482 -0.000144
C  1.360325 0.812793 -0.000114
C  -2.34726 -1.147523 -0.000038
C  -2.212748 1.673424 0.000019
C  2.479099 -1.357557 -0.000051
C  2.598259 1.467236 0.000012
C  -3.550413 -0.39078 0.000079
C  -3.465231 1.023456 0.000104
C  3.733055 -0.703727 0.000063
C  3.792356 0.709951 0.000094
H  -2.13935 2.763093 0.000045
H  2.410824 -2.448138 -0.000076
H  2.623575 2.559549 0.000037
