program: Gaussian 09
title: 000183017
version: EM64L-G09RevD.01
frameworkgroup: C1[X(C12H3Br3Cl2O2)]
method: RPBEPBE
basis: SDD
operation: Freq
keyword: #p
keyword: freq=noraman
keyword: PBEPBE/SDD
title: #p freq=noraman PBEPBE/SDD
converged: NO YES NO NO
title: Mulliken charges:
elementType: Br Br Br Cl Cl O O C C C C C C C C C C C C H H H
charge: 0.107728 0.081456 0.080675 0.053367 0.017413 -0.258965 -0.265457 0.430615 0.290612 0.272084 0.257715 -0.382876 -0.390123 -0.310001 -0.309555 -0.096466 -0.089370 -0.183494 -0.180840 0.294579 0.291710 0.289192
chargesum: 0.00000
title: Mulliken charges with hydrogens summed into heavy atoms:
elementType: Br Br Br Cl Cl O O C C C C C C C C C C C C
charge: 0.107728 0.081456 0.080675 0.053367 0.017413 -0.258965 -0.265457 0.430615 0.290612 0.272084 0.257715 -0.382876 -0.095544 -0.018291 -0.020363 -0.096466 -0.089370 -0.183494 -0.180840
polarizability: 3.70361401e+02 1.19252035e+01 2.26032648e+02 -4.30670944e-03 2.65659181e-02 6.83802649e+01
1716.lowfreq: -5.0071 -2.1691 -2.1637 -0.0004 0.0008 0.0016 21.3574 29.2126 66.6431
frequency: 21.3529 29.2113 66.6414 73.4379 106.8428 116.2465 128.2477 135.6627 162.2606 163.4218 189.7239 212.2115 223.3162 254.1722 282.5879 295.2485 355.5418 356.1987 362.7217 380.5083 443.3123 465.5502 518.3716 522.3864 538.7741 578.9780 595.8679 602.2301 611.8638 661.4944 689.8294 701.7707 738.4251 772.3669 849.6807 850.2061 854.5237 875.4926 878.3225 928.0783 1088.7961 1100.7691 1108.7640 1150.6748 1215.2046 1225.9340 1274.0175 1330.3463 1348.9922 1361.9448 1366.7192 1424.1695 1459.7066 1552.3880 1570.1351 1584.7837 1622.2394 3179.4830 3182.3837 3187.1607
redmass: 19.2045 33.2788 30.6977 31.1099 8.9898 53.9840 10.3106 34.7191 11.3160 33.6105 36.4055 26.9413 6.5346 19.9575 7.8679 21.7464 11.1181 12.0887 12.3831 15.1678 3.0838 8.1327 4.5203 8.0775 8.8896 11.6881 12.1496 10.2400 9.9463 4.1300 9.1897 7.4033 7.9605 9.2357 8.3094 1.4102 1.4174 9.1668 1.3890 12.0134 1.8288 7.1812 8.9112 1.8720 4.5149 1.2764 4.6446 9.2030 9.4792 8.3452 7.0594 5.3274 3.9385 10.9413 8.2716 10.6825 8.8650 1.0925 1.0931 1.0930
irintensity: 0.0016 0.0023 0.0680 0.0011 0.1526 0.0684 0.0812 0.2997 0.2881 0.0743 0.0378 0.0234 0.6051 0.1820 1.1807 0.1059 0.8165 0.0014 6.5222 14.2309 10.3376 7.9939 0.7139 1.6327 0.5163 0.0382 0.0008 0.1881 3.9789 0.1048 20.5574 4.3740 4.6064 80.3957 80.7334 2.0037 22.8960 159.8504 53.4847 18.6538 84.3731 34.6110 3.5129 65.3865 16.6842 1.4673 254.7822 1.7451 91.5284 115.9617 17.9523 778.6950 384.6235 67.5532 11.4804 12.0757 12.5988 2.3224 1.7986 3.9243
temp: 298.150 k
press: 1.00000 atm
elementType: 35 35 35 17 17 8 8 6 6 6 6 6 6 6 6 6 6 6 6 1 1 1
symmnumber: 1
zpe: 298633.9 jmol-1
zpe.correction: 0.113744 hartree
zpe.thermalcorrener: 0.131225 hartree
zpe.thermalcorrenthalpy: 0.132169 hartree
zpe.thermalcorrgfe: 0.064372 hartree
zpe.sumelectzpe: -1568.670285 hartree
zpe.sumelectthermal: -1568.652804 hartree
zpe.sumelectthermalent: -1568.651860 hartree
zpe.sumelectthermalfe: -1568.719657 hartree
dipole: -0.6263 0.8625 0.0002
dipole: 1.0659
quadrupole: -162.5221 -142.2172 -152.0073
quadrupole: 0.0164 0.0001 0.0015
quadrupole: -10.2732 10.0317 0.2415 0.0164 0.0001 0.0015
hfenergy: -1568.7840288 hartree
pointgroup: C01 [X(C12H3Br3Cl2O2)]
dipole: -0.2222189 0.3556338 0.0000729 debye
dipolederiv: 0.0718516 -0.0104568 0.0000026 0.0694711 -0.4942459 -0.000099 -0.0000634 -0.0000639 0.0528728 -0.4525325 -0.2699134 -0.0000284 -0.3794285 -0.19494 -0.0000319 -0.0002534 0.0000527 0.0212694 -0.5100287 0.2697455 0.0000776 0.3540597 -0.1567279 -0.0000364 -0.0000178 -0.0000084 0.0203929 -0.6413706 0.2245733 0.0000064 0.3017765 -0.1003355 0. 0.0000593 -0.0000192 0.0084464 -0.578319 -0.3281778 -0.0000875 -0.3957903 -0.3118116 -0.0000727 -0.0000877 -0.0000755 -0.0155439 -2.3375845 0.0266338 0.000021 -0.1008931 -0.2559599 -0.0000371 -0.0000042 -0.000069 -0.1295773 -2.3358192 0.0256152 0.0000225 -0.0674082 -0.398496 -0.0000157 0.0001183 -0.0000485 -0.142657 1.2834929 0.1085512 0.0000629 1.2106699 -0.2429355 -0.0000643 0.0000891 0.0000191 0.1239748 1.4538419 -0.1058366 0.0000045 -0.9962721 0.2691322 0.0000387 0.0000426 -0.0000273 0.0763482 1.4624209 -0.18034 -0.0000906 -0.9457518 0.1344479 0.0000196 -0.0001035 -0.0000109 0.0737254 1.3433468 0.1565866 -0.0000188 1.0559339 0.1490384 -0.0000041 -0.0000882 0.0000654 0.0787735 -0.3116797 -0.0035121 0.0000042 -0.0528794 0.9556385 0.0001904 0.000084 0.0001456 -0.1268891 -0.4676269 -0.0929974 -0.0000164 -0.1131806 -0.1239593 -0.0000123 -0.00013 0.0000176 -0.1104656 -0.4580279 -0.1083475 -0.0000136 -0.1399074 -0.0883746 0.0000155 -0.0000924 0.0000328 -0.0806965 -0.4846982 0.0949127 0.0000264 0.1116926 -0.0646951 0.0000001 0.0000032 0.0000027 -0.0868316 0.6930757 -0.3961182 -0.0000398 -0.6234748 -0.1738972 -0.0000708 -0.0001764 -0.0000119 -0.0254057 0.6783326 0.535696 0.0001382 0.6477459 0.4595689 0.0001295 0.0002213 0.0001033 -0.0501481 0.5858095 0.7331108 0.0000972 0.6957297 0.3010725 0.0000445 0.0003196 -0.000059 -0.1115043 0.7121184 -0.7109798 -0.0001774 -0.6615259 0.2171663 0.0000639 0.000027 0.0000345 -0.110659 0.1006025 0.0229367 -0.0000034 0.0220365 0.0534249 -0.0000164 0.0000244 -0.0000314 0.1838894 0.0953439 0.0375094 0.0000147 0.0214972 0.0363715 -0.0000235 0.0000389 -0.0000299 0.1747008 0.0974504 -0.0291916 -0.0000021 -0.0141009 0.0305175 -0.000018 -0.0000107 -0.000019 0.1759845 unknown
polarizability: 371.3178958|1.8016541|225.0761538|-0.0024496|0.026801|68.3802649 unknown
InChI: InChI=1S/C12H3Br3Cl2O2/c13-4-1-7-8(2-5(4)14)19-12-9(18-7)3-6(16)11(17)10(12)15/h1-3H
charge 0 multiplicity 1
22 atoms
Br 2.405862 -3.073433 -0.000528
Br -5.315745 -1.821177 -0.000146
Br -5.472716 1.674178 0.000437
Cl 5.16254 -1.176627 -0.000066
Cl 4.951951 2.068959 0.000493
O  -0.054266 -1.297207 -0.000418
O  -0.184561 1.620499 0.000114
C  1.109476 -0.495301 -0.000181
C  1.047563 0.92038 0.000066
C  -1.288467 -0.596111 -0.000187
C  -1.352231 0.816644 0.000056
C  2.364662 -1.138381 -0.000216
C  2.216422 1.689569 0.00027
C  -2.464172 -1.356842 -0.000234
C  -2.592315 1.467264 0.000239
C  3.557003 -0.36799 -0.00002
C  3.466894 1.043129 0.000223
C  -3.720521 -0.707325 -0.000055
C  -3.784278 0.706459 0.000182
H  2.144352 2.779475 0.000462
H  -2.392248 -2.447191 -0.000412
H  -2.620907 2.55943 0.000419
