program: Gaussian 09
title: 000015579
version: EM64L-G09RevD.01
frameworkgroup: C1[X(C14H19ClO3)]
method: RPBEPBE
basis: SDD
operation: Freq
keyword: #p
keyword: freq=noraman
keyword: PBEPBE/SDD
title: #p freq=noraman PBEPBE/SDD
converged: YES YES NO NO
title: Mulliken charges:
elementType: Cl O O O C C C C C C C C C C C C C C H H H H H H H H H H H H H H H H H H H
charge: -0.060167 -0.297983 -0.265965 -0.215131 0.184929 -0.369291 -0.704119 -0.703246 0.226693 -0.273184 -0.344716 0.300167 -0.685991 -0.317220 -0.315137 -0.192845 -0.194516 -0.110282 0.205635 0.209335 0.232726 0.250273 0.218660 0.209678 0.233032 0.258253 0.230543 0.225452 0.198015 0.197713 0.212585 0.212640 0.220316 0.262105 0.250529 0.254721 0.255792
chargesum: 0.00000
title: Mulliken charges with hydrogens summed into heavy atoms:
elementType: Cl O O O C C C C C C C C C C C C C C
charge: -0.060167 -0.297983 -0.265965 -0.215131 0.184929 0.045680 -0.002460 -0.002283 0.226693 0.182811 0.051012 0.300167 -0.040449 -0.055116 -0.064608 0.061876 0.061276 -0.110282
polarizability: 2.00873431e+02 -1.05622461e+01 1.92474217e+02 1.32181737e+01 -4.13886060e+00 1.16969080e+02
1716.lowfreq: -15.9255 -9.9982 -4.5484 0.0007 0.0011 0.0013 9.8426 11.6672 29.4498
frequency: -8.9114 11.2175 29.0096 46.3586 55.8108 66.6805 70.0620 104.2701 121.9373 160.1399 172.1448 200.4114 208.9874 215.8862 232.8191 246.3589 255.8981 272.0784 296.8315 322.5747 357.1697 379.7414 406.1587 417.6005 419.2849 436.6399 491.6372 520.7963 560.4579 623.4335 631.8128 697.9269 719.1270 737.0447 737.8584 792.5664 798.5255 818.6425 835.4544 851.1393 885.5822 908.4186 926.5752 932.8756 944.8116 946.8983 959.3704 995.8850 1003.8933 1038.3569 1065.9596 1076.5058 1093.4775 1104.5159 1124.3587 1140.9438 1143.4292 1158.8806 1190.3393 1208.8171 1225.7277 1244.0216 1267.6827 1269.8066 1278.5527 1284.1967 1342.3335 1357.7313 1369.5050 1376.6275 1390.3254 1392.1771 1392.9627 1450.9090 1459.5495 1463.3422 1467.1418 1468.2295 1471.7941 1475.2812 1479.6354 1481.9208 1489.5055 1582.4186 1588.9858 1618.3205 2969.1041 2976.2800 2988.7112 2999.8792 3001.4430 3004.2536 3012.3206 3041.5746 3068.3633 3077.1666 3077.8044 3098.8797 3104.3183 3110.9658 3126.1312 3157.5777 3157.8585 3175.9137 3179.5775
redmass: 2.0189 4.6354 3.4666 4.4170 5.1815 4.2481 4.5020 2.7981 2.8966 3.7912 3.7671 1.1333 1.4237 1.9889 1.8443 2.9765 2.4185 3.3899 4.0052 4.1092 4.1297 3.4610 3.7887 3.0649 4.2703 4.5410 5.0869 3.8227 3.4854 7.1023 4.8453 5.5848 5.2378 1.1166 3.2069 1.1472 6.0593 1.2426 2.2157 3.0295 4.5108 1.9004 1.1694 1.8423 1.6411 1.5861 1.3474 4.0156 1.3229 3.2932 2.5181 2.2756 1.3574 2.9418 2.6836 1.8659 1.7767 1.2988 2.7031 1.3650 4.2712 3.1762 1.1675 1.3222 1.2548 1.0796 1.4233 6.1464 1.5612 1.2401 2.5679 1.3961 1.2358 1.0523 1.0588 2.1843 1.0686 1.1022 1.0657 1.0423 1.0630 1.0592 1.0905 8.0677 6.4640 11.0038 1.0590 1.0369 1.0600 1.0568 1.0351 1.0355 1.1004 1.1037 1.1047 1.1043 1.0994 1.0999 1.0991 1.1009 1.1003 1.0884 1.0889 1.0969 1.0977
irintensity: 0.0057 0.0885 0.0945 0.7027 0.4326 0.2671 0.5877 0.2021 0.9681 1.7741 1.0854 0.0469 0.4574 0.8262 2.1479 5.7206 2.7230 4.5038 2.1020 4.9669 5.0071 3.7316 2.7024 1.3402 7.9845 6.5491 6.8335 17.5017 12.8396 0.9219 32.2509 17.4326 6.1727 5.9132 7.6663 0.5212 5.7185 0.3016 45.6179 46.1333 40.1058 2.6115 0.4488 13.8800 7.4451 10.1668 0.9465 51.1861 7.8893 18.7528 66.3593 42.3383 46.8267 239.0074 4.6732 92.0959 98.5741 9.7285 55.9282 0.1062 13.0438 17.7920 0.4023 4.7556 1.5834 0.0991 0.0653 0.8224 8.2799 30.4344 4.5812 12.3488 24.0098 6.8945 1.9062 159.6455 4.0176 6.7817 0.3434 13.2605 8.0385 15.9898 22.8729 0.4375 4.4011 151.7740 24.8162 29.3955 18.0494 37.8594 7.8652 19.8409 5.8783 2.8143 0.3237 121.5193 48.4801 1.6485 39.0974 18.2467 13.0517 5.1196 0.5140 6.9970 0.2775
temp: 298.150 k
press: 1.00000 atm
elementType: 17 8 8 8 6 6 6 6 6 6 6 6 6 6 6 6 6 6 1 1 1 1 1 1 1 1 1 1 1 1 1 1 1 1 1 1 1
symmnumber: 1
zpe: 784685.6 jmol-1
zpe.correction: 0.298871 hartree
zpe.thermalcorrener: 0.318222 hartree
zpe.thermalcorrenthalpy: 0.319166 hartree
zpe.thermalcorrgfe: 0.248518 hartree
zpe.sumelectzpe: -1229.234272 hartree
zpe.sumelectthermal: -1229.214921 hartree
zpe.sumelectthermalent: -1229.213976 hartree
zpe.sumelectthermalfe: -1229.284625 hartree
dipole: -2.8554 0.7704 -0.4870
dipole: 2.9974
quadrupole: -108.3864 -106.2369 -125.5591
quadrupole: 10.7113 0.2530 -0.3086
quadrupole: 5.0077 7.1573 -12.1649 10.7113 0.2530 -0.3086
hfenergy: -1229.5331427 hartree
pointgroup: C01 [X(C14H19Cl1O3)]
dipole: 1.0653792 0.4682946 0.1905369 debye
polarizability: 197.4464092|11.5209808|195.9202961|12.8220114|4.6700729|116.950023 unknown
InChI: InChI=1S/C14H19ClO3/c1-4-5-10-17-13(16)14(2,3)18-12-8-6-11(15)7-9-12/h6-9H,4-5,10H2,1-3H3
charge 0 multiplicity 1
37 atoms
Cl -4.132781 -3.413009 -0.356978
O  -0.832617 1.43566 1.095709
O  1.750063 0.716284 -0.017893
O  0.73768 1.238319 -2.04382
C  -0.128228 2.269822 0.054271
C  3.659013 -0.760481 0.290517
C  -1.141071 2.977736 -0.859759
C  0.696427 3.255266 0.898607
C  0.802894 1.366568 -0.799571
C  2.702412 -0.178405 -0.748971
C  4.699579 -1.706357 -0.35578
C  -1.594872 0.316321 0.669754
C  5.674847 -2.301331 0.682296
C  -0.995595 -0.966178 0.671861
C  -2.97115 0.460705 0.372178
C  -1.766683 -2.106877 0.357984
C  -3.748341 -0.675725 0.056178
C  -3.130813 -1.941528 0.048695
H  3.079044 -1.309923 1.057402
H  4.177524 0.066442 0.812628
H  -0.613853 3.63364 -1.573345
H  -1.727617 2.255151 -1.450025
H  -1.819837 3.59174 -0.243334
H  1.279138 3.932117 0.249157
H  0.011852 3.859661 1.517622
H  1.385441 2.705143 1.557736
H  3.22664 0.423759 -1.514152
H  2.11596 -0.958647 -1.269686
H  5.272886 -1.153115 -1.127116
H  4.175999 -2.528194 -0.885053
H  6.229045 -1.502282 1.209312
H  5.13288 -2.892543 1.443819
H  6.41507 -2.966329 0.201875
H  0.060656 -1.057344 0.941224
H  -3.431144 1.452621 0.409569
H  -1.316778 -3.103914 0.361674
H  -4.813271 -0.577073 -0.172587
