program: Gaussian 09
title: 000182990
version: EM64L-G09RevD.01
frameworkgroup: C1[X(C14H15IO3)]
method: RPBEPBE
basis: SDD
operation: Freq
keyword: #p
keyword: freq=noraman
keyword: PBEPBE/SDD
title: #p freq=noraman PBEPBE/SDD
converged: YES YES NO NO
title: Mulliken charges:
elementType: I O O O C C C C C C C C C C C C C C H H H H H H H H H H H H H H H
charge: 0.090493 -0.242395 -0.254147 -0.225502 -0.264068 0.200043 -0.515088 -0.499921 -0.359140 -0.332348 -0.328723 0.136730 0.395141 -0.327184 -0.389146 -0.165175 -0.156013 -0.340501 0.238137 0.248104 0.231743 0.235016 0.244661 0.227903 0.223710 0.222689 0.226572 0.227671 0.216691 0.259615 0.275494 0.249486 0.249450
chargesum: 0.00000
title: Mulliken charges with hydrogens summed into heavy atoms:
elementType: I O O O C C C C C C C C C C C C C C
charge: 0.090493 -0.242395 -0.254147 -0.225502 -0.025931 0.200043 -0.035241 -0.020244 0.092474 0.116913 0.115640 0.136730 0.395141 -0.067569 -0.113652 0.084310 0.093437 -0.340501
polarizability: 2.87208232e+02 -7.98543969e-01 1.46003494e+02 -5.04319819e-02 -1.15530736e+00 1.04083546e+02
1716.lowfreq: -4.8917 -4.6988 0.0006 0.0007 0.0007 18.3880 24.7368 35.9203 56.1710
frequency: 20.5625 34.9727 56.0776 71.6472 120.3038 143.0165 154.4162 158.7945 181.2685 217.8496 296.2060 312.5347 324.7174 339.5042 364.5118 400.7096 404.2769 431.0197 454.0530 476.6677 528.7488 538.1949 557.9543 560.9814 621.7456 678.3261 705.5906 715.8150 781.4537 811.0550 819.6778 821.1126 837.6838 857.7812 874.3743 886.5886 898.5935 920.6653 930.7072 934.8256 959.8790 966.8636 969.4969 980.8554 983.5367 989.3584 1038.4913 1042.5105 1052.0688 1059.9660 1067.1674 1112.0172 1112.2296 1116.3827 1134.9672 1165.5861 1167.9482 1168.5310 1187.8401 1220.3808 1254.6882 1281.1243 1293.1704 1317.6251 1322.6704 1327.4672 1364.2246 1368.6125 1381.5735 1383.8991 1445.6822 1467.0818 1471.3577 1473.2997 1477.3983 1487.4562 1581.0582 1603.2964 2987.1010 2994.5480 2998.7445 3067.0925 3072.3422 3073.8908 3089.4686 3097.3049 3107.6152 3158.0417 3158.9863 3176.9260 3181.2454 3192.4500 3210.7003
redmass: 4.0585 6.4935 5.4907 3.4847 4.4580 6.7727 4.3340 3.5518 3.8498 4.8222 3.5782 4.8931 2.4476 4.3351 3.8866 3.8423 3.2032 3.8479 3.2912 4.9810 3.5010 3.4771 6.4791 5.0491 7.1057 6.5127 7.9391 3.7826 1.0735 1.9684 1.3682 3.5124 1.2609 3.5031 3.3689 4.0459 6.4635 1.5504 5.5494 6.3202 2.8132 1.8616 1.9649 1.4033 2.2108 6.4237 4.7925 1.2710 1.8566 2.0677 1.2946 1.2860 1.2697 2.0150 1.5706 1.5191 1.5460 1.1348 1.1132 1.5356 1.7372 2.1459 1.2414 3.7143 1.3002 1.2922 1.3915 6.4493 1.8818 3.2220 1.0863 1.0877 1.0868 2.5700 1.3066 1.1108 7.9579 6.2130 1.0612 1.0604 1.0602 1.1042 1.1058 1.1056 1.0856 1.0525 1.0655 1.0888 1.0890 1.0964 1.0975 1.1165 1.1145
irintensity: 0.0400 0.6163 0.4236 0.5247 0.4323 1.0706 0.9122 2.6092 2.9713 3.3770 0.7351 13.4413 5.9065 6.9023 4.3514 7.4638 3.3025 4.9384 0.0891 1.5662 11.7024 4.1337 0.3297 2.6653 2.1077 2.5543 6.8189 1.9993 0.9199 170.4547 32.5817 5.0029 3.0367 13.2039 31.1816 5.4169 102.0236 3.4442 29.5303 10.3669 40.5432 5.8905 5.2116 0.7429 13.0579 215.8895 77.3329 36.7473 10.8257 111.7490 8.7303 0.3186 1.0921 5.2762 1.6106 3.9850 2.6292 7.1641 8.5178 0.2547 1.3061 5.9956 0.0188 210.2279 12.5297 1.7375 18.4198 1.9991 0.7937 16.7843 10.9757 6.8508 7.7985 34.8007 7.0156 0.2061 0.9801 54.1800 58.2482 55.0649 60.6562 14.5328 20.0997 26.8341 23.3014 19.4378 8.2352 1.8480 1.9053 7.2157 0.0726 0.4734 31.0951
temp: 298.150 k
press: 1.00000 atm
elementType: 53 8 8 8 6 6 6 6 6 6 6 6 6 6 6 6 6 6 1 1 1 1 1 1 1 1 1 1 1 1 1 1 1
symmnumber: 1
zpe: 679533.9 jmol-1
zpe.correction: 0.258821 hartree
zpe.thermalcorrener: 0.274831 hartree
zpe.thermalcorrenthalpy: 0.275775 hartree
zpe.thermalcorrgfe: 0.212940 hartree
zpe.sumelectzpe: -778.268205 hartree
zpe.sumelectthermal: -778.252195 hartree
zpe.sumelectthermalent: -778.251251 hartree
zpe.sumelectthermalfe: -778.314086 hartree
dipole: 6.2110 0.1048 0.1207
dipole: 6.2131
quadrupole: -93.3361 -113.9345 -125.1924
quadrupole: 1.2746 1.7743 0.3940
quadrupole: 17.4849 -3.1135 -14.3714 1.2746 1.7743 0.3940
hfenergy: -778.5270263 hartree
pointgroup: C01 [X(C14H15I1O3)]
dipole: 2.4421983 0.101451 0.0232074 debye
polarizability: 287.1851633|1.9935281|140.7274484|-0.0960958|-13.979578|109.3826598 unknown
InChI: InChI=1S/C14H15IO3/c15-12-5-3-11(4-6-12)14-16-7-13(8-17-14,9-18-14)10-1-2-10/h3-6,10H,1-2,7-9H2
charge 0 multiplicity 1
33 atoms
I  -6.478207 -0.2507 -0.003177
O  0.550975 -1.107568 -0.563931
O  0.460348 1.273659 -0.760845
O  0.4395 0.248191 1.402871
C  4.051426 0.33982 0.135935
C  2.532198 0.210778 0.082308
C  4.971488 -0.241111 -0.950828
C  4.980172 -0.840893 0.464231
C  1.998747 -1.213829 -0.219764
C  1.928511 1.15011 -0.997162
C  1.884505 0.625128 1.431587
C  -0.012062 0.124326 0.003719
C  -1.517201 0.049065 -0.026444
C  -2.153777 -1.142944 0.386606
C  -2.292947 1.157972 -0.429243
C  -3.56273 -1.233888 0.397073
C  -3.703732 1.080997 -0.424059
C  -4.324784 -0.116946 -0.00924
H  4.373115 1.309727 0.539222
H  5.829984 0.35748 -1.266964
H  4.528227 -0.838751 -1.753512
H  4.538786 -1.833338 0.594794
H  5.846012 -0.652063 1.104658
H  2.479183 -1.673056 -1.100871
H  2.110474 -1.879276 0.657249
H  2.336955 2.17287 -0.921932
H  2.098233 0.754924 -2.016452
H  2.328316 0.078055 2.281593
H  1.971398 1.716315 1.601131
H  -1.547175 -2.002097 0.686465
H  -1.792903 2.074233 -0.754179
H  -4.051685 -2.158797 0.714388
H  -4.301552 1.940706 -0.739125
