program: Gaussian 09
title: 000182980
version: EM64L-G09RevD.01
frameworkgroup: C1[X(C17H20O3)]
method: RPBEPBE
basis: SDD
operation: Freq
keyword: #pfreq=noraman
keyword: PBEPBE/SDD
title: #p freq=noraman PBEPBE/SDD
converged: YES YES NO NO
title: Mulliken charges:
elementType: O O O C C C C C C C C C C C C C C C C C H H H H H H H H H H H H H H H H H H H H
charge: -0.252765 -0.224818 -0.224835 0.167105 0.232701 -0.339302 -0.334958 -0.334961 0.071016 -0.743391 -0.744185 -0.743392 0.422761 -0.409115 -0.316113 -0.376693 -0.387229 0.301117 0.113115 -0.472810 0.221259 0.221312 0.217702 0.219279 0.219234 0.217750 0.219287 0.218987 0.219703 0.219461 0.218781 0.219500 0.219668 0.218988 0.219323 0.275766 0.255528 0.247970 0.247704 0.279551
chargesum: 0.00000
title: Mulliken charges with hydrogens summed into heavy atoms:
elementType: O O O C C C C C C C C C C C C C C C C C
charge: -0.252765 -0.224818 -0.224835 0.167105 0.232701 0.103269 0.102023 0.102023 0.071016 -0.085414 -0.086442 -0.085414 0.422761 -0.133350 -0.060584 -0.128723 -0.139525 0.301117 0.113115 -0.193259
polarizability: 3.11953713e+02 6.46226523e-01 1.59508677e+02 1.40771087e-02 2.77711207e-05 1.20899060e+02
1716.lowfreq: -133.1567 -50.7772 -5.4092 0.0006 0.0008 0.0011 6.3865 8.6190 13.4366
frequency: -133.1344 -50.2739 -3.1153 43.7660 67.3564 121.1404 137.6970 195.0930 196.9268 202.7268 213.1782 224.3139 246.7003 272.5525 295.1840 315.6507 322.5455 352.9591 359.0158 371.9919 402.1172 403.1602 436.8540 448.7918 473.6388 486.9890 516.0089 516.6983 548.3182 556.6006 560.7187 567.7674 612.2652 635.7598 647.1832 694.0964 738.7993 767.9600 791.3318 822.1286 830.7366 853.5733 884.0202 902.6030 916.2271 917.4075 919.4298 925.7190 928.6564 933.7300 936.1277 959.9137 961.7004 972.7897 990.1975 1009.0827 1017.3487 1022.1573 1052.2276 1082.7831 1117.6742 1138.9168 1140.4874 1180.7991 1188.4700 1205.9143 1214.8535 1214.9714 1232.1901 1270.0754 1270.2958 1302.5142 1316.0101 1330.8911 1334.0860 1358.7755 1369.4555 1379.9025 1384.1811 1407.8500 1411.2506 1465.5644 1466.4103 1467.1878 1476.7228 1478.7499 1489.4479 1491.3308 1491.9375 1503.8778 1505.7308 1568.7779 1624.5892 2129.5712 2982.7617 2983.0444 2988.1012 3001.1811 3002.7127 3009.1271 3058.6437 3064.4603 3065.2522 3074.9257 3074.9911 3080.7590 3081.3893 3086.9370 3088.2684 3149.6886 3151.7193 3174.9258 3181.8806 3431.1635
redmass: 2.5261 2.6669 3.7716 5.4234 5.0096 5.0433 4.3408 2.9628 3.3472 1.1771 5.1418 1.1605 1.1186 4.2599 2.7590 2.2980 2.9506 4.2641 2.4873 2.4746 3.2318 3.2050 3.2260 3.2041 4.7245 5.3363 3.1741 5.9085 5.8075 7.2516 4.4948 3.2600 1.2452 5.4217 1.2967 8.4796 3.7341 6.2551 2.8982 4.7168 2.3423 1.3095 2.7594 6.5860 1.3370 1.8429 2.1564 3.6596 5.8041 1.2157 5.0728 2.1596 2.0762 1.4303 1.3745 3.9277 1.4530 1.4316 3.5758 5.4712 1.3702 1.7308 1.7428 1.0686 1.1854 2.9655 2.1784 2.1709 2.6751 1.9727 1.9606 1.2796 4.1942 1.3102 1.2422 5.0706 1.3197 1.2010 1.1940 3.6176 1.1986 1.0500 1.0508 1.0517 1.0759 1.0750 1.0745 1.0540 1.0532 1.6201 1.4948 7.4610 6.3743 6.2704 1.0355 1.0357 1.0370 1.0560 1.0561 1.0574 1.1086 1.1067 1.1064 1.1014 1.1009 1.0975 1.1006 1.0986 1.0984 1.0889 1.0896 1.0963 1.0960 1.1556
irintensity: 0.0043 0.0001 0.0007 1.0056 1.0820 0.0362 0.1943 1.4198 1.9800 0.0021 0.6268 0.1136 0.0004 15.0430 9.1132 0.1635 4.5734 1.4958 0.2504 1.4717 0.0450 0.1628 2.3261 0.5276 0.5813 0.0003 0.4216 0.6705 1.4802 1.1603 5.7973 12.2445 66.1609 1.1315 66.4036 0.9059 6.4848 0.3345 0.0354 1.9671 221.7304 8.8096 11.9827 112.0654 0.0280 5.3236 7.8503 6.5389 30.8687 0.0576 32.3313 22.8632 9.5176 2.3873 0.0863 79.3439 1.9053 0.9292 95.7168 133.0349 3.5179 0.0396 0.0655 0.0264 19.2794 0.7256 6.5442 6.2841 72.4486 1.9996 2.0542 0.7042 233.8028 13.8153 0.5732 1.9222 5.4238 25.4333 25.8212 10.1913 31.1450 0.0384 0.2287 0.0188 6.1016 6.2864 12.5570 9.9358 8.8150 19.8593 3.7210 0.9123 5.4511 11.1878 20.9998 19.8035 6.7665 42.9221 41.4935 123.1411 0.8569 20.7230 16.2229 41.4471 35.7425 97.2483 0.6265 41.6230 42.6112 6.1095 7.5128 8.4484 0.9288 101.0568
temp: 298.150 k
press: 1.00000 atm
elementType: 8 8 8 6 6 6 6 6 6 6 6 6 6 6 6 6 6 6 6 6 1 1 1 1 1 1 1 1 1 1 1 1 1 1 1 1 1 1 1 1
symmnumber: 1
zpe: 856788.3 jmol-1
zpe.correction: 0.326333 hartree
zpe.thermalcorrener: 0.343072 hartree
zpe.thermalcorrenthalpy: 0.344016 hartree
zpe.thermalcorrgfe: 0.283808 hartree
zpe.sumelectzpe: -883.897083 hartree
zpe.sumelectthermal: -883.880344 hartree
zpe.sumelectthermalent: -883.879400 hartree
zpe.sumelectthermalfe: -883.939608 hartree
dipole: 5.6204 -0.0280 0.0005
dipole: 5.6204
quadrupole: -99.1118 -114.2147 -124.4033
quadrupole: -0.0082 0.0011 0.0000
quadrupole: 13.4648 -1.6381 -11.8267 -0.0082 0.0011 0.0000
hfenergy: -884.2234159 hartree
pointgroup: C01 [X(C17H20O3)]
dipole: 2.2111861 0.0165597 -0.0002001 debye
polarizability: 311.955997|-0.2634895|159.5063935|-0.0140771|-0.0000076|120.8990596 unknown
InChI: InChI=1S/C17H20O3/c1-5-13-6-8-14(9-7-13)17-18-10-16(11-19-17,12-20-17)15(2,3)4/h1,6-9H,10-12H2,2-4H3
charge 0 multiplicity 1
40 atoms
O  0.580604 -1.413015 0.000108
O  0.537062 0.659672 -1.196209
O  0.537264 0.660328 1.195292
C  2.63669 0.011009 -0.000459
C  4.226636 0.040396 -0.000587
C  2.072477 -1.437758 0.000122
C  2.030034 0.720207 -1.244008
C  2.030237 0.721126 1.242667
C  0.072527 -0.050882 -0.00022
C  4.800738 -0.675456 -1.259285
C  4.759134 1.504159 -0.00043
C  4.800941 -0.675804 1.257822
C  -1.437286 -0.056771 -0.000091
C  -2.170591 -1.263663 -0.000046
C  -2.119757 1.182722 -0.000049
C  -3.578678 -1.235029 0.000044
C  -3.525974 1.217052 0.000039
C  -4.277438 0.005908 0.000088
C  -5.71391 0.037381 0.000187
C  -6.949099 0.065429 0.00025
H  2.380443 -1.996269 -0.901352
H  2.380442 -1.995526 0.902054
H  2.305601 1.789378 -1.276781
H  2.338257 0.231725 -2.185333
H  2.338767 0.23346 2.184316
H  2.305651 1.790364 1.274505
H  4.514874 -1.7415 -1.302462
H  5.905083 -0.632974 -1.230451
H  4.478344 -0.193879 -2.199469
H  4.438204 2.067314 -0.8948
H  5.864388 1.488571 -0.000777
H  4.438767 2.066922 0.894387
H  4.478227 -0.194842 2.198212
H  5.905268 -0.632804 1.229116
H  4.515567 -1.742002 1.300444
H  -1.630588 -2.213765 -0.000074
H  -1.542363 2.111553 -0.00007
H  -4.150008 -2.168761 0.000085
H  -4.0565 2.174477 0.000075
H  -8.022936 0.090344 0.000244
