program: Gaussian 09
title: 000182947
version: EM64L-G09RevD.01
frameworkgroup: C1[X(C10H9N5OS)]
method: RPBEPBE
basis: SDD
operation: Freq
keyword: #p
keyword: freq=noraman
keyword: PBEPBE/SDD
title: #p freq=noraman PBEPBE/SDD
converged: YES YES NO NO
title: Mulliken charges:
elementType: S O N N N N N C C C C C C C C C C H H H H H H H H H
charge: 0.282011 -0.180527 -0.391088 -0.280287 -0.119447 -0.029334 -0.091150 -0.262591 -0.491016 0.146561 -0.129960 0.459575 -0.345381 -0.360267 -0.213822 -0.202751 -0.236347 0.329504 0.279814 0.268576 0.321565 0.252611 0.279663 0.236893 0.238799 0.238394
chargesum: 0.00000
title: Mulliken charges with hydrogens summed into heavy atoms:
elementType: S O N N N N N C C C C C C C C C C
charge: 0.282011 -0.180527 -0.069523 -0.280287 -0.119447 -0.029334 -0.091150 0.066913 0.057375 0.146561 -0.129960 0.459575 -0.092770 -0.080604 0.023071 0.036049 0.002048
polarizability: 2.48164065e+02 3.63261278e+00 1.63517398e+02 -1.06857396e+01 4.37658414e+00 8.63896687e+01
1716.lowfreq: -6.3241 -4.0571 0.0021 0.0023 0.0028 5.7639 21.2321 26.8350 39.9913
frequency: 20.9214 26.6395 39.9791 58.8570 98.4886 121.7013 133.6815 203.2523 222.8669 261.5422 313.9612 323.6557 353.2350 406.4876 446.7674 461.8720 478.2020 485.3441 529.9740 574.5666 611.4407 619.3613 652.5438 674.1647 684.6348 695.4040 733.2901 768.1405 843.8506 880.5795 890.9643 920.3132 931.6802 959.2094 979.1242 981.2932 988.4000 990.7650 995.3056 1000.4219 1008.2400 1033.5473 1072.3741 1089.4761 1090.5358 1154.7697 1177.0151 1180.8551 1188.5843 1194.9980 1220.9777 1253.6569 1284.9376 1323.9877 1330.5956 1378.3237 1387.2428 1428.0553 1450.3364 1488.4384 1597.9673 1610.0140 1758.2816 3062.5702 3108.6654 3138.0799 3141.4804 3146.3886 3157.5281 3170.9869 3183.5598 3549.5723
redmass: 6.8952 5.1273 5.6641 4.9194 6.5260 7.0009 7.8961 5.8216 9.3534 5.7766 6.5461 6.8938 7.9707 2.8650 7.2393 4.3207 1.5702 6.4812 4.5905 2.1781 6.5286 2.4977 10.5351 10.5200 6.6873 2.1165 5.1095 1.6660 1.2487 10.2289 3.7156 2.3555 2.7752 2.1748 1.4400 2.5503 6.4608 10.7451 7.4510 1.3301 3.3823 1.9984 1.4664 1.8650 1.5768 10.9471 1.0531 1.4911 1.7634 1.9619 1.8040 1.3427 4.2035 1.7093 1.4504 5.0116 10.3078 1.1026 2.3602 2.5851 6.6526 6.0638 10.9448 1.0606 1.0918 1.0856 1.1061 1.0893 1.0942 1.0983 1.0984 1.0822
irintensity: 0.4900 3.0264 1.8660 1.6155 4.2552 1.1883 1.8028 1.1640 0.8616 11.0460 0.4732 4.0354 0.9093 0.2814 3.5226 4.2491 50.5714 7.1597 11.8295 51.7740 0.1940 151.6624 4.9015 1.3925 5.1227 40.0820 9.3275 74.2821 1.5543 28.4708 52.5085 14.2257 19.4010 15.9019 14.1771 89.9712 0.5556 12.0821 19.6018 0.4222 51.5980 2.2337 14.6053 46.6961 9.9431 12.5174 0.1844 15.2414 19.8176 5.7424 9.8240 184.6971 41.5674 64.9560 5.2958 52.1332 2.9845 14.8694 3.4045 85.0039 4.6099 18.1181 619.6547 1.7826 2.3513 1.1980 2.7866 5.7418 22.0123 14.5844 3.8522 30.9114
temp: 298.150 k
press: 1.00000 atm
elementType: 16 8 7 7 7 7 7 6 6 6 6 6 6 6 6 6 6 1 1 1 1 1 1 1 1 1
symmnumber: 1
zpe: 482842.3 jmol-1
zpe.correction: 0.183905 hartree
zpe.thermalcorrener: 0.198552 hartree
zpe.thermalcorrenthalpy: 0.199496 hartree
zpe.thermalcorrgfe: 0.139082 hartree
zpe.sumelectzpe: -1132.224364 hartree
zpe.sumelectthermal: -1132.209717 hartree
zpe.sumelectthermalent: -1132.208773 hartree
zpe.sumelectthermalfe: -1132.269187 hartree
dipole: -3.6770 -3.6141 2.0615
dipole: 5.5527
quadrupole: -112.6003 -116.5500 -101.9184
quadrupole: 13.7555 5.4339 1.0103
quadrupole: -2.2440 -6.1938 8.4378 13.7555 5.4339 1.0103
hfenergy: -1132.4082687 hartree
pointgroup: C01 [X(C10H9N5O1S1)]
dipole: -1.4271897 -1.4710426 0.7560267 debye
dipolederiv: -0.7521789 0.1887091 -0.0546187 0.2296488 -0.1002601 0.0375755 -0.1646119 0.0386272 -0.065866 -1.407618 0.3189044 0.2883387 0.5579737 -0.508179 -0.090912 0.313598 -0.0301007 -0.4465465 -1.3133151 0.0812896 0.1764019 0.147814 -0.4292907 0.0085429 0.4095219 -0.0668854 -0.6501077 -0.5431227 -0.0978194 -0.009589 -0.3173487 -0.5827503 -0.0346781 -0.0554609 0.0119205 0.0422082 -0.3546073 -0.030781 -0.0229499 0.2332299 -0.6772262 0.0632677 0.0625839 0.0619882 -0.1430245 -0.4227059 0.1477108 -0.0271189 0.4238838 0.4024362 -0.0079228 0.0611387 0.062178 -0.0921952 -0.1333441 -0.3587115 0.0319023 -0.2501003 -0.0589371 -0.0100475 -0.0776592 -0.0965506 -0.1584091 1.74424 -0.1749198 0.1566316 -0.2156398 0.2676191 0.0501949 0.4910858 -0.0310286 0.1739697 -0.2185802 0.1595766 0.0189387 0.1799738 -0.1226104 0.1395377 -0.1366232 0.1254991 -0.06631 1.8527224 -0.478486 -0.5887738 -0.5395076 0.5568681 -0.1090613 -1.0115733 -0.0354746 0.846712 0.8614193 -0.0010857 0.0649119 -0.7469959 0.5172094 -0.1171795 0.0465926 -0.0694246 0.0296323 0.6298743 0.3074193 -0.018277 0.4927186 0.304246 0.0679284 -0.0477034 0.0128314 0.0904577 -0.0827887 -0.05151 -0.0517518 -0.0834284 -0.1205722 0.0067882 -0.0987134 -0.005178 -0.1178551 -0.1882128 -0.0248792 -0.0203012 -0.0625791 0.0016243 0.0450881 0.000163 0.0262918 -0.1123686 -0.1067401 -0.03532 -0.0433218 0.02898 0.1199045 0.096071 -0.0056557 0.104038 -0.0930528 0.1289325 -0.045695 -0.0932722 -0.0593377 -0.0613015 0.0459924 -0.1041249 0.0353187 -0.0956759 -0.0063431 0.0900061 -0.0201066 0.0529686 -0.0060681 0.0155945 -0.0178602 0.0226604 -0.1375686 -0.159439 0.0261307 0.0086679 -0.0786908 0.0190798 -0.068371 0.0193889 -0.0410616 0.0285721 0.0371645 -0.033024 -0.0032458 -0.0537583 -0.013344 0.01087 0.0176094 -0.0065972 0.1059185 0.1056205 0.0001131 -0.0820843 -0.0061978 0.0835531 -0.024906 -0.0780346 -0.0111715 -0.002827 0.2264757 0.0524099 0.0741845 0.0987457 0.2562668 0.0960144 0.129887 0.0810201 0.2001944 -0.0178881 0.0276491 0.0731351 0.0448541 0.1038015 -0.015063 0.1333896 0.0002526 0.1314725 0.1401776 -0.0093142 0.0171649 0.0086027 0.01689 -0.0624799 -0.0068258 -0.0541954 0.1416605 0.0815122 0.0243866 0.0319811 -0.0079818 -0.0613294 -0.0832544 0.0180455 -0.0844373 0.1175547 -0.075743 0.0245579 0.0755903 0.0369637 0.0809435 -0.0382899 0.0817931 -0.0331642 0.1204934 -0.0255118 -0.1073171 0.0175621 -0.1147912 0.0114269 -0.0213004 0.0200489 -0.0173563 0.1529612 unknown
polarizability: 248.2111681|5.5054885|163.417883|-8.7716469|6.2714524|86.4420811 unknown
InChI: InChI=1S/C10H9N5OS/c16-8-6-9(11-8)17-10-12-13-14-15(10)7-4-2-1-3-5-7/h1-5,9,11H,6H2
charge 0 multiplicity 1
26 atoms
S  1.152542 -0.753754 0.247193
O  5.79162 -1.23591 -0.376104
N  3.844331 -0.934928 1.053018
N  -1.15216 0.882063 -0.066675
N  0.779411 2.008136 0.029672
N  -1.465755 2.275523 -0.149542
N  -0.293647 2.916446 -0.085091
C  2.866216 0.071224 0.647492
C  3.75838 0.390561 -0.596212
C  4.709038 -0.723845 -0.052978
C  0.219498 0.763284 0.043586
C  -2.209342 -0.087879 -0.078884
C  -1.994348 -1.379769 -0.614377
C  -3.473906 0.283542 0.438105
C  -3.052187 -2.314513 -0.604779
C  -4.523372 -0.657313 0.430273
C  -4.316871 -1.959479 -0.083559
H  2.645259 0.891477 1.343557
H  4.197231 1.399988 -0.590648
H  3.302936 0.18259 -1.574984
H  3.903204 -1.531368 1.881553
H  -1.029273 -1.652969 -1.053257
H  -3.619513 1.293568 0.829961
H  -2.888027 -3.315343 -1.017405
H  -5.502444 -0.373303 0.829843
H  -5.134722 -2.687429 -0.082355
