program: Gaussian 09
title: 000182965
version: EM64L-G09RevD.01
frameworkgroup: C1[X(C12H5Cl4F3N2OS)]
method: RPBEPBE
basis: SDD
operation: Freq
keyword: #p
keyword: freq=noraman
keyword: PBEPBE/SDD
title: #p freq=noraman PBEPBE/SDD
converged: YES YES NO NO
title: Mulliken charges:
elementType: Cl Cl Cl Cl S F F F O N N C C C C C C C C C C C C H H H H H
charge: 0.054947 0.031978 0.015809 0.016722 0.368315 -0.145381 -0.186084 -0.116428 -0.206559 -0.500724 -0.013411 -0.443866 0.200005 0.814894 0.274154 -0.101075 -0.275574 -0.339391 0.275731 -0.077708 -0.091854 -0.254779 -0.719993 0.356679 0.290762 0.249761 0.252518 0.270553
chargesum: 0.00000
title: Mulliken charges with hydrogens summed into heavy atoms:
elementType: Cl Cl Cl Cl S F F F O N N C C C C C C C C C C C C
charge: 0.054947 0.031978 0.015809 0.016722 0.368315 -0.145381 -0.186084 -0.116428 -0.206559 -0.144046 -0.013411 -0.443866 0.200005 0.814894 0.274154 -0.101075 -0.275574 -0.339391 0.275731 -0.077708 -0.091854 0.035983 0.052839
polarizability: 3.01768162e+02 1.63232384e-01 2.02590087e+02 -8.82353763e+00 -9.07763484e-01 1.39606354e+02
1716.lowfreq: -3.3240 -1.3189 -0.0018 0.0013 0.0017 1.2843 13.5124 22.7512 32.2578
frequency: 13.4210 22.7270 32.2494 48.9389 63.3079 71.1308 74.3710 90.3214 103.6565 122.6026 125.7444 147.5742 163.6659 185.0583 198.3477 203.7564 225.7795 257.2248 292.6601 297.3094 303.5399 316.2512 318.9760 324.4439 331.9387 335.6412 368.2182 422.8327 461.1314 481.2975 498.5409 527.3497 529.1695 548.6998 580.0285 587.4388 591.0022 603.9617 629.6915 639.0510 653.1255 683.0619 717.0327 735.2880 813.4217 831.8572 840.7293 856.1128 922.8535 937.0250 969.3343 1020.2973 1036.4165 1061.2135 1082.4105 1144.4744 1151.2017 1161.6255 1219.1562 1249.1938 1316.3792 1342.8276 1381.3315 1398.6743 1403.5343 1449.6868 1456.0000 1485.5263 1500.7621 1520.0976 1554.5611 1563.4494 1593.6720 2995.0146 3076.0599 3120.9013 3186.7717 3471.4799
redmass: 15.2507 10.6135 11.1254 16.6644 26.1253 1.0648 14.6524 14.8166 11.4174 14.3971 6.9093 9.9332 8.3001 30.5548 13.4069 12.2596 11.9313 5.5330 6.5490 13.2487 8.1054 10.1591 14.6786 17.3056 14.5064 9.2691 9.4722 10.6763 12.9724 13.3713 10.2333 5.7324 6.6228 4.9795 6.9897 9.4020 3.8128 1.8620 11.9531 8.2706 7.8094 8.9520 7.4418 10.7534 11.4570 11.5213 11.4768 1.4377 9.4769 8.1987 2.7328 8.8957 1.4253 6.4617 7.8539 4.4734 5.4468 1.4993 10.0029 3.9568 9.6996 10.7457 3.6029 1.2345 6.8997 1.1807 1.0439 2.9841 4.2537 4.9585 6.9427 8.1025 5.6561 1.0373 1.0977 1.0991 1.0933 1.0782
irintensity: 0.7169 0.6105 0.4238 0.8638 0.4979 0.3922 1.3821 1.0429 1.6315 0.7605 0.3283 1.0536 0.6183 0.0740 3.1459 4.4996 0.5240 8.0399 5.6631 0.2020 2.8613 1.7209 8.0142 0.6751 1.7178 0.2976 0.3693 0.1872 22.2818 4.6769 1.0146 4.1697 0.5601 15.5384 9.6054 2.9310 27.7193 21.3167 22.1574 20.0191 41.0715 27.6749 4.7906 47.7004 3.8084 13.5182 46.8982 20.3461 63.4303 151.3574 37.9074 52.1493 4.7214 264.3218 12.3215 36.2205 161.9203 35.1271 88.9475 92.3196 129.6077 23.2476 106.6925 12.7432 167.6295 37.6463 22.3305 66.8803 385.4028 52.1413 60.4361 8.0408 89.3495 6.1471 6.7803 2.8104 4.0750 109.7061
temp: 298.150 k
press: 1.00000 atm
elementType: 17 17 17 17 16 9 9 9 8 7 7 6 6 6 6 6 6 6 6 6 6 6 6 1 1 1 1 1
symmnumber: 1
zpe: 395016.6 jmol-1
zpe.correction: 0.150454 hartree
zpe.thermalcorrener: 0.173285 hartree
zpe.thermalcorrenthalpy: 0.174229 hartree
zpe.thermalcorrgfe: 0.094570 hartree
zpe.sumelectzpe: -3181.172411 hartree
zpe.sumelectthermal: -3181.149580 hartree
zpe.sumelectthermalent: -3181.148636 hartree
zpe.sumelectthermalfe: -3181.228295 hartree
dipole: 2.3299 -1.0561 -1.6383
dipole: 3.0377
quadrupole: -135.5251 -170.6739 -172.2399
quadrupole: 0.9282 -17.0102 3.2590
quadrupole: 23.9545 -11.1942 -12.7602 0.9282 -17.0102 3.2590
hfenergy: -3181.3228651 hartree
pointgroup: C01 [X(C12H5Cl4F3N2O1S1)]
dipole: 0.7670773 -0.9163887 0.0133887 debye
polarizability: 295.3506104|-30.7407383|165.2189565|-6.1907507|-28.4995561|183.3950365 unknown
InChI: InChI=1S/C12H5Cl4F3N2OS/c1-3-20-10(12(17,18)19)9(23-3)11(22)21-8-6(15)4(13)2-5(14)7(8)16/h2,21H,1H3
charge 0 multiplicity 1
28 atoms
Cl -1.062474 1.855329 -1.872717
Cl -2.230034 -1.67935 2.254657
Cl -5.411605 -1.063242 1.836559
Cl -4.243415 2.28397 -2.374662
S  2.68833 -2.21016 -1.257266
F  1.808163 1.899565 0.870994
F  1.375273 0.382499 2.506602
F  3.463602 1.230599 2.25879
O  -0.062009 -1.136624 -1.79671
N  -0.446906 -0.221024 0.324492
N  4.011133 -0.815152 0.585879
C  1.809284 -0.9623 -0.303292
C  2.694441 -0.35018 0.591908
C  -1.825261 0.051824 0.114094
C  0.369617 -0.776903 -0.663824
C  4.195221 -1.783015 -0.30166
C  -2.266088 0.952039 -0.89581
C  -2.795449 -0.557158 0.957789
C  2.371148 0.779833 1.530591
C  -4.168353 -0.298296 0.77631
C  -3.647916 1.17245 -1.084236
C  -4.60228 0.554837 -0.254965
C  5.491804 -2.488232 -0.550019
H  -0.100355 -0.174196 1.289445
H  -5.667903 0.74238 -0.404841
H  5.3972 -3.578349 -0.397547
H  5.847855 -2.326219 -1.583556
H  6.248076 -2.096724 0.147995
