program: Gaussian 09
title: 000182975
version: EM64L-G09RevD.01
frameworkgroup: C1[X(C14H18O4)]
method: RPBEPBE
basis: SDD
operation: Freq
keyword: #pfreq=noraman
keyword: PBEPBE/SDD
title: #p freq=noraman PBEPBE/SDD
converged: YES YES NO NO
title: Mulliken charges:
elementType: O O O O C C C C C C C C C C C C C C H H H H H H H H H H H H H H H H H H
charge: -0.263619 -0.273119 -0.251770 -0.244170 -0.345650 -0.109507 0.449983 -0.197782 0.436538 -0.206310 -0.170044 -0.733442 -0.829225 -0.706517 0.316007 0.298087 -0.764208 -0.762981 0.211013 0.266172 0.253383 0.263161 0.242214 0.234776 0.241078 0.241977 0.224856 0.227165 0.212983 0.236455 0.245886 0.255884 0.247895 0.254863 0.248892 0.249077
chargesum: 0.00000
title: Mulliken charges with hydrogens summed into heavy atoms:
elementType: O O O O C C C C C C C C C C C C C C
charge: -0.263619 -0.273119 -0.251770 -0.244170 -0.134638 0.156666 0.449983 0.055601 0.436538 0.056850 0.072170 -0.257587 -0.135226 -0.257079 0.316007 0.298087 -0.014543 -0.010149
polarizability: 2.02002081e+02 4.23109543e+00 1.44736026e+02 -5.23442550e+00 5.05054251e+00 1.41338746e+02
1716.lowfreq: -49.8356 -35.9306 -4.9591 -0.0009 -0.0007 -0.0004 7.0326 11.4123 17.1327
frequency: -49.8185 -35.9202 16.5681 29.7986 37.6614 57.7409 78.1080 82.9148 91.6939 139.1292 152.9268 165.1639 188.3369 195.4534 255.1758 265.2519 270.3037 300.3349 324.1828 365.2480 400.3488 421.6252 462.4125 491.3160 522.6984 527.8794 569.2568 577.5859 581.2185 589.9126 629.2655 641.8773 702.5480 738.2551 754.2703 769.7557 807.8515 873.0192 887.5639 892.2354 908.5542 925.6794 944.1725 955.8235 960.1488 967.3861 995.0749 998.2233 998.8137 1009.9723 1022.5070 1041.7466 1045.2882 1046.8659 1055.3777 1093.4745 1167.4782 1188.1625 1194.8223 1197.7350 1234.8397 1268.6855 1288.3664 1293.6950 1312.8623 1325.7102 1357.5758 1368.4055 1383.1931 1384.6055 1394.9383 1413.4310 1422.0762 1454.2430 1455.2645 1458.1921 1458.5297 1463.5883 1477.0374 1636.6855 1640.0360 1665.3043 1670.8960 1683.1465 2918.4003 2948.8552 2965.5490 3005.8696 3008.6598 3032.3711 3041.4379 3088.7112 3096.1147 3096.7335 3101.7131 3109.9372 3128.7608 3138.5339 3140.3173 3162.0635 3217.4878 3218.4879
redmass: 1.0549 1.0739 8.0085 4.9551 3.1372 6.2917 3.0438 3.4771 3.5959 4.4370 3.5126 4.3450 1.3604 2.8795 3.6385 5.1190 4.1810 3.6025 4.1938 3.3269 3.3776 3.0126 3.4894 2.8164 3.4080 3.7379 4.4499 3.3300 3.5834 2.9282 3.3243 3.0027 1.2358 2.4987 1.8570 2.1508 3.0135 3.7289 4.1908 4.1296 3.5295 2.7305 1.3614 1.4530 2.7723 2.2401 1.8225 1.3597 1.7470 1.5916 2.4840 1.8094 1.6308 1.6234 1.6626 1.9890 1.1465 3.0487 1.9010 2.4633 1.7104 1.7004 1.3469 1.5287 1.6991 1.3222 2.1253 1.5257 1.2259 1.2243 1.2096 1.1624 1.1790 1.0662 1.0674 1.0474 1.0479 1.0487 1.0581 10.4011 10.6214 6.8555 5.4737 6.1400 1.0801 1.0803 1.0381 1.0372 1.0365 1.0855 1.0959 1.0986 1.0958 1.0972 1.0646 1.0619 1.0865 1.1017 1.1012 1.0988 1.1115 1.1144
irintensity: 1.1786 1.6921 1.5816 0.6808 0.1649 1.6445 1.2613 3.0239 1.3557 3.3511 2.0390 3.7310 2.9049 4.8720 0.8520 6.5257 0.5009 0.7214 5.2587 2.0750 2.7766 2.2740 5.4669 4.7694 0.7033 5.7685 9.3238 1.2032 6.3637 8.3317 4.7553 1.4207 0.1546 4.8477 2.3742 20.1627 11.7192 31.0773 46.1564 41.3684 37.0715 16.3032 77.2041 62.9488 83.1506 37.0603 56.7864 0.7837 47.6530 14.4008 20.0623 17.8697 6.4575 4.8348 0.0810 29.2158 17.2224 597.9692 86.9479 132.5367 6.2014 1.9902 3.8175 1.0328 7.6600 1.7742 12.3303 5.9790 49.6860 52.9344 21.5771 17.7136 6.3482 12.1821 14.7089 5.4285 25.6679 13.9833 18.0409 198.8048 222.2054 0.8289 14.2762 13.2387 19.3967 15.8267 27.6554 3.2698 3.0870 12.0029 18.7947 25.2373 7.2737 5.7337 17.8545 2.6077 2.8843 7.8334 8.0671 13.1883 10.9350 5.0713
temp: 298.150 k
press: 1.00000 atm
elementType: 8 8 8 8 6 6 6 6 6 6 6 6 6 6 6 6 6 6 1 1 1 1 1 1 1 1 1 1 1 1 1 1 1 1 1 1
symmnumber: 1
zpe: 756671.0 jmol-1
zpe.correction: 0.288201 hartree
zpe.thermalcorrener: 0.306368 hartree
zpe.thermalcorrenthalpy: 0.307312 hartree
zpe.thermalcorrgfe: 0.239700 hartree
zpe.sumelectzpe: -843.773473 hartree
zpe.sumelectthermal: -843.755306 hartree
zpe.sumelectthermalent: -843.754362 hartree
zpe.sumelectthermalfe: -843.821974 hartree
dipole: 0.2006 0.5607 2.2935
dipole: 2.3695
quadrupole: -108.6757 -102.4763 -106.1502
quadrupole: -8.0867 1.7927 -5.3423
quadrupole: -2.9083 3.2911 -0.3828 -8.0867 1.7927 -5.3423
hfenergy: -844.0616738 hartree
pointgroup: C01 [X(C14H18O4)]
dipole: -0.0293419 -0.2746627 0.8903731 debye
polarizability: 181.7796933|26.7004851|163.3953675|11.7823991|1.6295534|142.9017923 unknown
InChI: InChI=1S/C14H18O4/c1-8(2)14-9(3)12(17-10(4)15)6-7-13(14)18-11(5)16/h6-7,12-14H,1,3H2,2,4-5H3
charge 0 multiplicity 1
36 atoms
O  1.247867 1.712223 0.607389
O  -2.39329 -0.904307 0.332736
O  1.687653 3.677586 -0.572572
O  -3.551703 -2.047485 -1.345697
C  1.331794 -0.555912 -0.424522
C  1.200874 0.963136 -0.708625
C  0.068587 -1.026662 0.3155
C  -1.17551 -0.858458 -0.542997
C  2.647703 -1.059359 0.17255
C  -0.112506 1.275507 -1.398389
C  -1.183974 0.446894 -1.319015
C  0.050758 -1.507121 1.579747
C  2.979471 -2.497594 -0.1971
C  3.474001 -0.320717 0.958694
C  1.50795 3.083257 0.516404
C  -3.523767 -1.539903 -0.200697
C  1.557629 3.714236 1.891783
C  -4.66852 -1.516129 0.788141
H  1.277719 -0.999185 -1.446759
H  2.05393 1.329133 -1.310027
H  -1.277626 -1.701338 -1.262057
H  -0.162653 2.210596 -1.966052
H  -2.1148 0.67954 -1.850694
H  0.976253 -1.600943 2.157059
H  -0.889819 -1.783493 2.064996
H  2.147855 -3.176466 0.072881
H  3.137244 -2.600823 -1.289209
H  3.8912 -2.84888 0.314765
H  4.412958 -0.744024 1.335796
H  3.235493 0.705216 1.248776
H  2.601699 3.985585 2.131812
H  1.17725 3.025948 2.660229
H  0.968508 4.64623 1.888926
H  -4.372677 -1.037299 1.732297
H  -5.006769 -2.548978 0.98006
H  -5.520682 -0.970215 0.346971
