program: Gaussian 09
title: 000182924
version: EM64L-G09RevD.01
frameworkgroup: C1[X(C20H26O3)]
method: RPBEPBE
basis: SDD
operation: Freq
keyword: #pfreq=noraman
keyword: PBEPBE/SDD
title: #p freq=noraman PBEPBE/SDD
converged: YES YES NO NO
title: Mulliken charges:
elementType: O O O C C C C C C C C C C C C C C C C C C C C H H H H H H H H H H H H H H H H H H H H H H H H H H
charge: -0.297247 -0.283851 -0.280669 0.057248 -0.386780 -0.719009 -0.691162 0.377593 0.450690 0.024903 -0.435180 0.373086 0.348899 -0.367778 -0.376100 -0.385455 -0.421204 -0.357699 -0.390804 -0.352939 -0.356350 -0.690699 -0.692695 0.181911 0.189385 0.212984 0.227936 0.243698 0.210990 0.213955 0.201788 0.244521 0.196205 0.214462 0.216983 0.236478 0.249849 0.252413 0.229994 0.236560 0.249152 0.246374 0.249858 0.211715 0.244374 0.228050 0.203404 0.235362 0.224803
chargesum: 0.00000
title: Mulliken charges with hydrogens summed into heavy atoms:
elementType: O O O C C C C C C C C C C C C C C C C C C C C
charge: -0.297247 -0.283851 -0.280669 0.239158 0.015589 -0.036384 -0.030898 0.377593 0.450690 0.221107 -0.003735 0.373086 0.348899 -0.131300 -0.126251 -0.133042 -0.191210 -0.121139 -0.141653 -0.106565 -0.106492 -0.006560 -0.029127
polarizability: 3.74039919e+02 -6.78052783e+00 2.00688272e+02 -9.25613430e+00 3.15193164e+00 1.50359771e+02
1716.lowfreq: -10.5355 -5.9921 -0.0013 -0.0003 0.0011 1.3609 4.9246 14.9668 26.3866
frequency: -5.6013 14.9171 26.3329 42.0094 52.4477 57.3670 79.6031 91.3219 95.3842 104.7574 141.9948 148.2362 159.9706 167.9368 182.6339 191.0307 212.7960 227.7585 237.5793 255.6768 299.3996 325.4905 332.4413 357.3622 365.9796 378.4627 409.1721 413.7196 418.1012 434.3992 461.0679 465.9411 486.9626 514.7528 517.6813 543.0896 590.8865 626.6256 632.3991 705.0152 710.5683 714.1465 736.5818 783.7478 790.7717 808.9149 812.1458 823.1610 828.2595 832.0814 842.3742 853.8891 897.9022 906.0381 924.0099 927.9937 939.9572 940.7273 953.1701 960.6620 967.5037 971.1372 994.9673 997.1844 1004.0187 1010.9968 1039.1696 1105.2897 1108.9530 1119.0883 1120.5167 1121.4778 1150.0466 1172.2542 1173.8366 1183.5990 1184.6704 1194.0329 1199.2410 1217.4638 1230.2747 1235.3134 1265.1585 1296.3995 1300.9647 1304.3150 1321.7909 1336.1168 1343.4242 1347.0095 1360.2003 1375.3086 1381.4271 1384.6785 1388.3110 1390.8933 1397.7171 1419.7628 1425.6669 1450.7794 1455.2671 1464.0018 1468.7327 1470.5025 1474.0791 1474.8754 1478.5947 1488.7449 1488.9365 1493.1806 1502.2111 1583.8521 1585.1339 1624.1483 1626.1290 2927.3530 2956.6873 2974.6308 2980.6396 2984.9398 2987.9130 2989.1250 2989.1889 2993.1481 3040.9756 3073.5598 3083.3870 3083.6883 3091.8531 3092.5695 3094.6536 3095.0254 3102.1134 3120.8582 3144.9939 3145.7855 3150.9965 3164.1238 3166.1256 3167.8608 3173.0943
redmass: 3.1896 4.6989 4.2778 4.0534 3.4298 4.3028 3.3202 4.0269 3.6867 2.1878 2.7123 3.0771 3.8619 3.6598 1.0294 1.1536 2.2513 1.4041 1.4655 2.6581 3.3185 3.3109 3.7636 3.5831 5.1874 3.0812 3.1047 3.0667 3.1030 3.1244 3.0245 3.5670 2.9824 2.5931 2.5572 4.8221 5.2094 6.7588 6.6261 3.2910 3.6038 3.4408 3.3075 2.2879 1.3360 2.4105 1.7691 1.3646 1.5705 2.0409 2.7959 3.6157 2.5323 1.5199 2.3549 1.4230 1.3468 1.3957 1.3333 1.3688 1.7158 3.1662 1.8644 1.8746 2.6127 1.7140 3.2791 1.6594 1.4179 1.5910 2.1387 1.3713 2.0608 1.4075 1.3830 1.8702 1.8815 2.4717 1.1617 2.2593 4.5361 2.9200 1.2041 1.3059 1.2690 1.3218 1.2867 1.2658 1.8050 1.4771 1.6252 4.6790 1.2656 1.2513 1.2354 2.4152 1.2587 3.3286 3.8502 1.0779 1.0485 1.0565 1.0486 1.0535 1.1978 1.0600 1.0532 1.0574 1.0705 1.9961 2.5692 7.2582 7.4741 6.4653 6.4549 1.0584 1.0835 1.0844 1.0376 1.0454 1.0358 1.0528 1.0993 1.0360 1.1001 1.0994 1.0988 1.0993 1.1000 1.0999 1.0999 1.0999 1.1003 1.0895 1.0875 1.0868 1.0877 1.0948 1.0955 1.0960 1.0973
irintensity: 1.5950 0.4635 0.3158 0.1980 0.7154 1.2151 0.5044 0.0366 2.2230 0.2243 1.4653 2.6101 2.7297 0.6609 0.1209 0.1064 2.2743 0.6783 0.1264 2.2679 2.1538 0.4998 3.9792 2.4348 2.6900 0.6697 1.0954 0.6706 0.0512 1.3519 2.1200 3.9221 2.9281 3.7936 25.7993 8.9544 8.8010 0.4923 2.0702 24.4284 3.2545 5.3473 1.0855 12.4475 14.4982 7.4212 45.9332 4.5560 65.5952 27.0221 14.9164 32.1256 47.4968 8.7462 49.8910 22.7891 0.2328 2.3971 0.0994 1.7808 56.8501 89.9001 10.0657 104.5997 1.3608 5.7582 9.1287 82.2133 14.0126 40.7873 26.1412 27.1848 14.3900 1.8020 151.7596 81.6500 229.2699 447.9273 6.6040 102.5904 8.4548 80.4810 0.6260 7.4981 13.3361 4.3987 18.4173 19.0920 30.3696 45.4088 6.2838 4.7296 33.5482 22.7329 24.2607 15.4463 26.5074 4.4505 2.7556 5.9151 5.8160 5.3336 2.7770 7.6860 131.9565 28.6556 8.5904 13.4777 40.2094 210.4587 178.1603 18.5322 0.8979 1.8999 67.4896 33.8933 27.0459 27.8877 39.6148 5.4162 16.3829 61.6075 24.1938 28.1001 13.2615 51.3964 34.5220 12.2696 33.6911 39.8772 49.1145 33.3470 36.4704 17.5267 16.3365 27.9394 5.2985 14.8971 14.9874 5.3515 2.2530
temp: 298.150 k
press: 1.00000 atm
elementType: 8 8 8 6 6 6 6 6 6 6 6 6 6 6 6 6 6 6 6 6 6 6 6 1 1 1 1 1 1 1 1 1 1 1 1 1 1 1 1 1 1 1 1 1 1 1 1 1 1
symmnumber: 1
zpe: 1077838.0 jmol-1
zpe.correction: 0.410527 hartree
zpe.thermalcorrener: 0.433849 hartree
zpe.thermalcorrenthalpy: 0.434793 hartree
zpe.thermalcorrgfe: 0.356216 hartree
zpe.sumelectzpe: -1001.646868 hartree
zpe.sumelectthermal: -1001.623546 hartree
zpe.sumelectthermalent: -1001.622602 hartree
zpe.sumelectthermalfe: -1001.701179 hartree
dipole: 0.2607 0.6920 1.8721
dipole: 2.0128
quadrupole: -109.6353 -128.8043 -142.2235
quadrupole: -17.5755 -2.0073 1.1670
quadrupole: 17.2524 -1.9166 -15.3358 -17.5755 -2.0073 1.1670
hfenergy: -1002.0573947 hartree
pointgroup: C01 [X(C20H26O3)]
dipole: 0.1305016 0.0688037 0.7780424 debye
polarizability: 372.8502314|-7.0677179|195.9091442|-17.8104707|15.8466217|156.328586 unknown
InChI: InChI=1S/C20H26O3/c1-5-16(4)23-20-12-10-18(11-13-20)21-14-17-6-8-19(9-7-17)22-15(2)3/h6-13,15-16H,5,14H2,1-4H3
charge 0 multiplicity 1
49 atoms
O  -5.61846 -0.653396 -0.029578
O  6.402614 0.328612 -0.384213
O  -0.008592 -0.134428 -0.346896
C  -6.500922 0.188954 0.82155
C  -7.906256 0.047782 0.211057
C  -6.433024 -0.281517 2.285358
C  -8.016987 0.64758 -1.205318
C  -4.229023 -0.433572 -0.013476
C  2.209366 0.695298 0.179825
C  7.105314 -0.985149 -0.430258
C  0.72818 0.883854 0.424226
C  5.014895 0.364483 -0.180166
C  -1.407929 -0.171068 -0.184881
C  -3.564598 0.58744 0.705227
C  -3.470928 -1.324246 -0.819564
C  2.78315 -0.595797 0.118073
C  3.062383 1.820652 0.049962
C  4.172365 -0.771976 -0.061783
C  4.45031 1.663527 -0.121373
C  -2.156195 0.720088 0.617797
C  -2.076723 -1.194535 -0.905377
C  7.298804 -1.53392 0.994767
C  8.429291 -0.698574 -1.145596
H  -6.171936 1.247065 0.732766
H  -8.627383 0.540345 0.893188
H  -8.164306 -1.028743 0.189401
H  -6.806207 -1.317892 2.366669
H  -5.400785 -0.258543 2.67509
H  -7.059077 0.366148 2.926608
H  -9.03016 0.501217 -1.621497
H  -7.808454 1.734429 -1.196569
H  -7.290937 0.166997 -1.88322
H  6.498679 -1.686928 -1.039731
H  0.479252 0.755802 1.500974
H  0.407607 1.900395 0.115205
H  -4.117108 1.291276 1.334503
H  -3.998929 -2.107033 -1.372639
H  2.130241 -1.471488 0.192367
H  2.639919 2.832752 0.077945
H  4.577356 -1.786957 -0.111071
H  5.113851 2.527112 -0.227326
H  -1.670366 1.523098 1.179894
H  -1.483983 -1.873061 -1.526474
H  7.804402 -2.516665 0.961419
H  6.336339 -1.658635 1.519872
H  7.924604 -0.839945 1.583173
H  9.024184 -1.625386 -1.236337
H  8.245848 -0.295258 -2.155853
H  9.017913 0.043008 -0.577421
