program: Gaussian 09
title: 000182922
version: EM64L-G09RevD.01
frameworkgroup: C1[X(C21H28O2)]
method: RPBEPBE
basis: SDD
operation: Freq
keyword: #pfreq=noraman
keyword: PBEPBE/SDD
title: #p freq=noraman PBEPBE/SDD
converged: YES YES NO NO
title: Mulliken charges:
elementType: O O C C C C C C C C C C C C C C C C C C C C C H H H H H H H H H H H H H H H H H H H H H H H H H H H H
charge: -0.278403 -0.283476 0.317326 -0.594663 -0.722547 -0.722837 -0.716354 0.497177 -0.380181 -0.414392 -0.398646 -0.363752 0.354026 -0.440281 0.453917 0.024705 0.373320 -0.422785 -0.383277 -0.390449 -0.358056 -0.692663 -0.690698 0.203585 0.203223 0.236821 0.208070 0.199719 0.238115 0.200181 0.207982 0.213233 0.209443 0.208991 0.233303 0.229248 0.247024 0.246664 0.216100 0.218812 0.196141 0.230525 0.251136 0.249437 0.236841 0.203506 0.235432 0.224881 0.211885 0.244303 0.228393
chargesum: 0.00000
title: Mulliken charges with hydrogens summed into heavy atoms:
elementType: O O C C C C C C C C C C C C C C C C C C C C C
charge: -0.278403 -0.283476 0.317326 -0.187855 -0.077937 -0.076560 -0.084688 0.497177 -0.146879 -0.185144 -0.151622 -0.117088 0.354026 -0.005369 0.453917 0.220846 0.373320 -0.192260 -0.132142 -0.141012 -0.121215 -0.028845 -0.006118
polarizability: 3.74982443e+02 3.94957734e+00 2.10857642e+02 -1.37605649e+01 -2.37944464e+00 1.55402307e+02
1716.lowfreq: -10.1391 -1.7871 -0.0014 -0.0008 0.0013 3.1052 11.7026 15.6183 25.7970
frequency: 8.1943 15.4036 25.4307 39.8837 50.8457 58.4976 76.3640 86.5710 99.0876 122.4532 152.1115 169.1130 178.6705 189.7333 204.6425 225.0510 235.3213 262.5370 268.9174 279.5734 286.0378 317.4964 326.4631 345.5210 351.4973 364.7274 380.4364 403.6788 411.9927 415.8725 421.4566 449.8320 457.2204 463.1114 510.8101 521.6626 553.1324 598.5214 629.3618 635.8416 697.9507 713.7536 728.6228 747.0126 773.1180 808.7903 816.0522 820.4385 824.0979 839.8141 845.6295 854.0044 886.6200 899.6723 921.6741 926.6123 929.6667 929.8466 938.7510 940.2035 941.8652 942.8196 960.3991 964.4436 965.4834 1003.3006 1004.7954 1008.2587 1022.9498 1026.1181 1104.8015 1108.3937 1121.1084 1147.0142 1150.3394 1173.9461 1179.2158 1184.7976 1198.9296 1206.1120 1214.2668 1219.0991 1222.2989 1235.8519 1237.8413 1281.3458 1304.2712 1310.8966 1312.6822 1321.4054 1340.0306 1346.9442 1372.7591 1374.2359 1379.3263 1380.4510 1390.5186 1396.0654 1398.9726 1416.4793 1419.5119 1455.1357 1458.1085 1460.3258 1467.3532 1467.7320 1468.9120 1469.0138 1474.1887 1482.8406 1483.7544 1487.9518 1497.0865 1499.8022 1502.3729 1580.5920 1584.4011 1621.9296 1625.8977 2933.5265 2961.7861 2963.7992 2965.4606 2972.0646 2972.7652 2988.2983 2993.1535 2995.8051 3021.3086 3054.8338 3058.7484 3060.1721 3065.9140 3073.9923 3077.9255 3083.9466 3093.0010 3095.4579 3101.7706 3121.4715 3121.5071 3125.9455 3144.5323 3158.2178 3162.7770 3164.2723 3167.9630
redmass: 3.1768 4.5946 4.4968 3.0899 3.9137 3.7462 3.4269 3.5945 4.1723 3.7286 3.0080 4.6272 1.0696 3.9787 1.0662 1.4422 1.8244 1.4169 1.8878 1.2997 2.0271 3.0603 3.5612 2.6744 3.6700 2.8474 2.4250 1.9077 2.9579 2.9613 2.8201 2.8145 3.4915 3.0380 3.2155 2.7439 3.6703 4.7400 6.7938 6.5933 3.5896 3.3723 3.9956 3.4482 4.1712 2.1122 1.7085 1.8056 1.4112 1.9016 2.5618 3.6277 1.7814 2.2100 1.8756 1.7108 1.5771 1.6203 1.3899 1.3302 1.3762 1.2070 1.4026 1.3454 6.0161 2.4825 2.6667 1.8066 1.4310 1.4215 1.6786 1.3763 1.3589 1.2355 2.0492 1.3749 1.3272 1.8065 1.1664 2.0906 1.8915 2.5458 4.0110 2.8199 3.0089 2.1283 1.3068 1.3508 1.5686 1.3013 1.4331 1.8309 1.2058 1.2210 1.5566 2.6718 2.4250 1.2935 1.2123 3.2516 3.3341 1.0501 1.0503 1.0750 1.0668 1.0505 1.0489 1.0484 1.1420 1.0639 1.0615 1.0587 1.0627 2.4470 2.5019 6.8918 7.1288 6.4544 6.4525 1.0581 1.0390 1.0509 1.0352 1.0400 1.0846 1.0357 1.0360 1.1028 1.1021 1.0999 1.0993 1.0993 1.0983 1.0990 1.0984 1.0991 1.0996 1.1001 1.1003 1.0891 1.0894 1.0886 1.0876 1.0939 1.0954 1.0947 1.0958
irintensity: 1.0920 0.3899 0.2042 0.5498 0.5313 1.1334 0.9539 0.1312 2.7221 0.9750 2.1717 0.3478 0.3111 0.9911 0.0158 0.3507 0.1343 0.2953 0.3415 0.1763 0.4763 0.7646 7.6883 0.5179 0.3083 1.6583 0.7230 0.0896 1.5172 0.0528 0.9467 1.1104 0.6914 3.6394 21.7483 6.3540 9.4724 26.6547 1.5023 1.6606 1.8472 0.2777 3.9187 5.7876 9.6873 7.8912 64.8566 0.5133 16.9686 11.5415 43.9335 32.0807 1.2457 7.4980 31.1385 39.5968 0.8853 1.6663 2.2493 0.0730 1.3046 0.0251 5.3987 0.1957 120.9687 1.4526 11.3576 2.8144 0.2135 0.1124 79.7028 10.7856 35.2962 13.6749 14.6600 152.4699 108.6948 117.5712 3.1357 14.3159 269.3392 66.7192 75.9586 95.3888 13.3375 1.3945 1.1470 1.6731 2.2454 17.7564 1.7537 61.6111 20.1155 21.1923 24.7799 20.6947 30.1474 22.4132 16.7322 0.7618 3.7697 5.0757 0.0707 0.4298 3.8308 4.5478 7.2399 2.5447 60.3548 13.7445 7.3157 12.9545 27.6153 39.2638 244.0082 13.7475 7.3042 72.3652 58.2655 33.2789 15.8756 67.9251 44.7687 26.1520 28.3094 16.5923 28.4026 30.2427 15.0273 0.3882 7.6626 54.3912 98.6884 12.2303 86.7694 13.1082 42.3699 28.3347 37.3903 32.0782 3.7591 25.0302 13.2271 18.7132 3.9673 15.5085 5.7636
temp: 298.150 k
press: 1.00000 atm
elementType: 8 8 6 6 6 6 6 6 6 6 6 6 6 6 6 6 6 6 6 6 6 6 6 1 1 1 1 1 1 1 1 1 1 1 1 1 1 1 1 1 1 1 1 1 1 1 1 1 1 1 1
symmnumber: 1
zpe: 1139524.2 jmol-1
zpe.correction: 0.434022 hartree
zpe.thermalcorrener: 0.458378 hartree
zpe.thermalcorrenthalpy: 0.459322 hartree
zpe.thermalcorrgfe: 0.377056 hartree
zpe.sumelectzpe: -965.739571 hartree
zpe.sumelectthermal: -965.715215 hartree
zpe.sumelectthermalent: -965.714271 hartree
zpe.sumelectthermalfe: -965.796538 hartree
dipole: -0.9446 -0.4246 -1.0688
dipole: 1.4882
quadrupole: -118.3195 -129.8649 -143.6365
quadrupole: 10.3140 1.7338 -1.5178
quadrupole: 12.2875 0.7421 -13.0296 10.3140 1.7338 -1.5178
hfenergy: -966.1735932 hartree
pointgroup: C01 [X(C21H28O2)]
dipole: 0.3772087 -0.1440353 -0.4240089 debye
polarizability: 374.0399303|17.7671987|189.5406594|8.9515092|-26.9910171|177.6618022 unknown
InChI: InChI=1S/C21H28O2/c1-16(2)23-20-12-8-18(9-13-20)15-22-19-10-6-17(7-11-19)14-21(3,4)5/h6-13,16H,14-15H2,1-5H3
charge 0 multiplicity 1
51 atoms
O  -0.076577 0.19263 0.052631
O  6.314271 0.304781 0.728527
C  -6.717238 0.157558 0.254177
C  -5.760949 -0.230817 -0.934009
C  -6.489569 -0.779117 1.468372
C  -6.485032 1.628157 0.686973
C  -8.177329 -0.003291 -0.248453
C  -4.266359 -0.148864 -0.659657
C  -3.537876 1.051255 -0.89216
C  -3.541722 -1.265903 -0.176307
C  -2.155186 1.13576 -0.645803
C  -2.152424 -1.204518 0.081368
C  -1.454646 0.005323 -0.156581
C  0.70575 -0.978659 0.497353
C  2.167066 -0.590329 0.542632
C  7.025011 1.089034 -0.321407
C  4.943656 0.041428 0.586485
C  2.998139 -1.044067 1.598116
C  2.747265 0.191514 -0.483172
C  4.372263 -0.740849 1.621516
C  4.121843 0.512637 -0.470994
C  8.297414 1.59894 0.362506
C  7.315162 0.200417 -1.544204
H  -6.022094 -1.263611 -1.241517
H  -6.013749 0.42787 -1.789622
H  -5.460122 -0.687973 1.858423
H  -7.189517 -0.526065 2.287116
H  -6.659438 -1.838031 1.19292
H  -5.454867 1.78068 1.055432
H  -6.653938 2.323395 -0.158058
H  -7.183428 1.9065 1.498869
H  -8.898143 0.256665 0.549607
H  -8.376354 0.657067 -1.114173
H  -8.379084 -1.045692 -0.561545
H  -4.06454 1.931217 -1.28084
H  -4.07055 -2.21062 0.000464
H  -1.597307 2.059317 -0.829569
H  -1.637545 -2.093802 0.456801
H  0.533058 -1.807825 -0.223082
H  0.356677 -1.310208 1.496705
H  6.387104 1.951153 -0.607382
H  2.569154 -1.638384 2.414416
H  2.109926 0.568011 -1.289974
H  5.01866 -1.084294 2.434811
H  4.531723 1.12521 -1.279323
H  8.892515 2.208887 -0.340909
H  8.045536 2.217045 1.240895
H  8.915955 0.749536 0.701971
H  7.831704 0.785149 -2.327586
H  6.389833 -0.215684 -1.977962
H  7.966794 -0.641533 -1.251196
