program: Gaussian 09
title: 000182929
version: EM64L-G09RevD.01
frameworkgroup: C1[X(C20H27NO2)]
method: RPBEPBE
basis: SDD
operation: Freq
keyword: #p
keyword: freq=noraman
keyword: PBEPBE/SDD
title: #p freq=noraman PBEPBE/SDD
converged: YES YES NO NO
title: Mulliken charges:
elementType: O O N C C C C C C C C C C C C C C C C C C C C H H H H H H H H H H H H H H H H H H H H H H H H H H H
charge: -0.261901 -0.262762 -0.060232 0.017097 -0.619340 -0.394336 -0.415169 0.520887 -0.718976 -0.714450 -0.404931 -0.416002 -0.385480 -0.355652 0.341517 -0.293650 -0.280710 0.175974 0.475484 -0.488788 -0.324504 -0.793139 -0.325591 0.200161 0.206830 0.201441 0.193608 0.204402 0.222739 0.206784 0.214050 0.222038 0.211097 0.215044 0.219991 0.213724 0.229235 0.227495 0.247895 0.242532 0.222227 0.199939 0.214128 0.244258 0.258722 0.229806 0.231185 0.236022 0.234424 0.234875
chargesum: 0.00000
title: Mulliken charges with hydrogens summed into heavy atoms:
elementType: O O N C C C C C C C C C C C C C C C C C C C C
charge: -0.261901 -0.262762 -0.060232 0.217258 -0.211068 0.003674 0.014354 0.520887 -0.071791 -0.065691 -0.175695 -0.188507 -0.137585 -0.113120 0.341517 0.128516 0.177676 0.175974 0.475484 -0.230066 -0.094698 -0.091508 -0.090717
polarizability: 3.42592257e+02 9.49455304e-01 1.92396857e+02 1.92464867e+01 1.25840513e-01 1.76697312e+02
1716.lowfreq: -12.6994 -2.8685 -0.0009 0.0009 0.0015 0.7460 13.0189 13.2556 15.3488
frequency: 11.4393 13.1620 14.7288 25.6337 33.9374 39.2425 46.7557 82.2431 87.9738 99.1574 116.4207 137.9742 157.1367 173.6535 209.7035 216.1917 219.8858 221.4426 230.5614 258.8469 281.0824 305.6538 307.0858 336.7943 342.9818 410.1589 413.2984 425.9227 444.8344 447.2405 461.9765 506.6197 513.0153 530.9825 571.6967 583.5176 632.8976 648.9319 711.6350 735.7627 737.3450 746.0072 757.0678 761.3584 801.4250 812.9219 816.9851 826.8412 836.5363 841.9427 887.4891 895.9872 901.9792 927.8014 939.0459 941.5752 957.7103 960.9555 965.4407 966.0203 1004.0635 1005.6590 1005.8537 1028.4550 1028.6537 1045.3143 1047.3967 1056.4602 1077.4316 1103.6525 1113.4567 1122.6230 1148.2216 1153.0673 1161.8673 1179.2112 1184.1860 1203.5858 1215.1528 1224.8936 1245.0277 1253.3626 1269.8876 1273.9609 1276.2642 1290.7009 1305.3407 1318.7731 1333.5578 1334.0096 1344.4021 1348.9528 1354.6225 1371.4541 1388.2655 1389.5991 1390.5235 1397.2365 1411.9660 1416.8321 1452.6817 1455.6901 1460.8578 1461.3347 1467.4494 1467.8606 1471.4867 1478.6389 1479.7190 1483.6157 1488.8573 1491.9698 1501.6847 1552.1714 1583.2295 1603.9556 1623.1727 2939.6621 2958.7100 2962.5252 2972.3923 2972.7180 2977.9912 2982.2359 2985.7761 3010.8001 3011.0296 3026.6871 3027.3892 3032.1049 3061.9910 3066.2731 3069.4168 3070.2441 3073.0347 3082.0961 3093.9226 3114.6262 3122.2974 3130.1947 3157.0807 3157.6103 3163.6966 3166.3246
redmass: 3.7032 3.7284 3.9103 2.5573 1.3728 3.4532 4.3019 3.5781 3.9199 3.4936 2.2418 3.0467 2.7454 4.4116 2.7600 3.2823 1.7126 2.2084 1.7761 2.2540 1.9017 2.7509 2.4901 2.7444 3.0946 3.0093 3.3644 3.6716 3.5197 2.8448 2.8402 5.6998 2.2311 2.4446 4.4589 3.9241 6.6730 5.1073 3.1920 3.0149 3.6942 1.7232 5.1230 1.5528 1.5197 1.7631 2.0067 1.3033 3.0609 1.7952 1.3750 1.5915 3.2490 1.5260 1.9701 2.5100 1.3842 1.5459 2.9835 1.8478 2.4779 1.7434 1.4855 2.5790 1.7924 2.3766 1.5724 2.4318 1.5048 1.8405 1.7839 1.3787 1.9012 2.3922 1.9147 1.2621 1.2579 1.0939 2.0844 4.4858 1.2967 1.1096 1.2609 1.1136 3.2033 1.4953 1.3209 1.3956 1.7520 3.0570 1.4930 1.7465 1.3799 2.4982 1.2296 1.9151 1.2795 1.2310 2.5482 3.2548 2.1141 1.1323 1.0825 1.1042 1.0456 1.0714 1.1678 1.0645 1.0739 1.0457 1.0586 1.0687 2.4415 6.0283 6.9558 5.9318 6.4626 1.0813 1.0573 1.0592 1.0590 1.0374 1.0379 1.0374 1.0620 1.0651 1.1002 1.0989 1.0999 1.0984 1.0973 1.0994 1.0996 1.0989 1.0999 1.1045 1.0991 1.0892 1.0892 1.0878 1.0937 1.0971 1.0952 1.0937
irintensity: 0.1806 0.1819 0.2787 0.0510 0.8806 0.2904 0.0437 1.4103 2.4230 0.3991 0.9521 1.0404 6.1140 1.3919 0.6836 0.0084 0.1724 0.5695 1.1550 3.6693 0.2846 0.4675 0.7330 1.2269 0.2000 0.6074 3.0125 1.4333 0.7480 11.8050 0.9088 1.5875 1.9986 23.8741 10.1970 3.7939 0.5383 13.0554 5.0874 6.2651 0.9689 18.0332 12.5832 5.5651 31.3488 3.0431 0.1083 47.8088 4.3309 38.0119 8.6911 3.9943 62.9879 5.2990 12.1493 23.2999 0.6134 1.2088 24.1073 1.9070 11.0295 7.4150 2.7503 87.8943 0.3506 30.5931 14.3527 1.3542 4.6755 3.7697 12.4425 19.2105 9.7997 7.6058 171.3757 30.3853 24.2442 1.9029 83.2152 253.5855 0.1030 7.3284 1.5315 8.8083 89.7159 3.4310 2.0732 2.2768 24.9497 137.2227 0.6352 14.9059 0.1662 5.9774 24.4214 9.1889 13.1389 16.9169 112.1611 0.4608 29.1004 6.9461 25.9932 62.7236 13.9360 4.4869 61.0202 9.7454 30.5800 3.1999 5.1168 4.2231 145.3476 63.9016 6.1491 203.3720 41.1554 15.8127 37.5758 22.6263 54.9522 31.4497 48.6640 25.0539 23.6796 15.2653 20.6321 45.9011 20.8329 40.4177 17.2408 49.8914 56.7903 89.9510 41.4647 20.3957 18.8796 20.8327 24.5211 11.0426 18.7814 33.4078 5.2163 0.9761
temp: 298.150 k
press: 1.00000 atm
elementType: 8 8 7 6 6 6 6 6 6 6 6 6 6 6 6 6 6 6 6 6 6 6 6 1 1 1 1 1 1 1 1 1 1 1 1 1 1 1 1 1 1 1 1 1 1 1 1 1 1 1
symmnumber: 1
zpe: 1112693.1 jmol-1
zpe.correction: 0.423802 hartree
zpe.thermalcorrener: 0.448054 hartree
zpe.thermalcorrenthalpy: 0.448998 hartree
zpe.thermalcorrgfe: 0.364340 hartree
zpe.sumelectzpe: -981.777674 hartree
zpe.sumelectthermal: -981.753423 hartree
zpe.sumelectthermalent: -981.752479 hartree
zpe.sumelectthermalfe: -981.837137 hartree
dipole: 1.2905 -0.1633 -1.1407
dipole: 1.7301
quadrupole: -110.3139 -133.5530 -137.7392
quadrupole: 6.4027 0.6593 2.9690
quadrupole: 16.8881 -6.3510 -10.5371 6.4027 0.6593 2.9690
hfenergy: -982.2014768 hartree
pointgroup: C01 [X(C20H27N1O2)]
dipole: -0.5005327 -0.1750508 0.4267732 debye
polarizability: 343.1629971|-5.1534946|191.4591237|15.8029866|3.7974785|177.0643054 unknown
InChI: InChI=1S/C20H27NO2/c1-4-17(5-2)15-18-6-8-19(9-7-18)22-12-13-23-20-14-16(3)10-11-21-20/h6-11,14,17H,4-5,12-13,15H2,1-3H3
charge 0 multiplicity 1
50 atoms
O  -0.588139 -0.212802 -0.369379
O  -3.440863 -0.382416 0.473209
N  -5.32422 -0.937503 -0.852429
C  5.949168 0.007909 0.223376
C  4.923664 0.956625 0.926582
C  7.373085 0.26128 0.790064
C  5.873095 0.094767 -1.327774
C  3.467598 0.640773 0.615126
C  8.454955 -0.698316 0.24849
C  6.340064 1.434968 -1.94147
C  2.698729 1.458004 -0.257065
C  2.834654 -0.49685 1.173525
C  1.358709 1.153617 -0.563211
C  1.491473 -0.824211 0.879147
C  0.749968 0.007166 0.002904
C  -1.266806 -1.385896 0.196471
C  -2.69502 -1.387937 -0.317005
C  -4.774632 -0.187779 0.133986
C  -6.835171 1.032187 0.569344
C  -5.478504 0.802559 0.870252
C  -7.426094 0.249746 -0.467976
C  -7.645705 2.074756 1.313735
C  -6.643028 -0.705456 -1.138889
H  5.665743 -1.032702 0.497872
H  5.148545 2.004728 0.648724
H  5.095592 0.88118 2.019879
H  7.327722 0.16694 1.894849
H  7.672348 1.309703 0.586376
H  4.826613 -0.0978 -1.634568
H  6.475629 -0.726962 -1.762303
H  9.423609 -0.530471 0.754753
H  8.617963 -0.561065 -0.836008
H  8.166837 -1.754231 0.413107
H  6.21789 1.420504 -3.04014
H  7.406151 1.635737 -1.72813
H  5.753829 2.289349 -1.555774
H  3.158032 2.349579 -0.70165
H  3.398011 -1.141723 1.86007
H  0.765899 1.786056 -1.231299
H  1.042071 -1.710813 1.336557
H  -1.258016 -1.343354 1.304046
H  -0.752157 -2.312189 -0.135872
H  -3.164187 -2.379842 -0.177452
H  -2.737398 -1.130846 -1.38967
H  -4.955272 1.365111 1.648479
H  -8.47672 0.38854 -0.743125
H  -7.045598 2.578963 2.089465
H  -8.027203 2.848002 0.621004
H  -8.524719 1.617172 1.804795
H  -7.068794 -1.31966 -1.940296
