program: Gaussian 09
title: 000182854
version: EM64L-G09RevD.01
frameworkgroup: C1[X(C10H11Cl3)]
method: RPBEPBE
basis: SDD
operation: Freq
keyword: #p
keyword: freq=noraman
keyword: PBEPBE/SDD
title: #p freq=noraman PBEPBE/SDD
converged: NO YES NO NO
title: Mulliken charges:
elementType: Cl Cl Cl C C C C C C C C C C H H H H H H H H H H H
charge: -0.014616 -0.057183 -0.000399 -0.208518 0.778648 -0.688589 -0.688601 -0.347889 -0.355697 0.576291 -0.312247 -0.455255 -0.794981 0.230754 0.229574 0.217193 0.224757 0.224749 0.217183 0.229588 0.267314 0.250258 0.250259 0.227406
chargesum: 0.00000
title: Mulliken charges with hydrogens summed into heavy atoms:
elementType: Cl Cl Cl C C C C C C C C C C
charge: -0.014616 -0.057183 -0.000399 0.022236 0.778648 -0.017064 -0.017081 -0.347889 -0.355697 0.576291 -0.312247 -0.187941 -0.067057
polarizability: 1.82189120e+02 1.02526635e+00 1.52423620e+02 -1.25189151e-03 2.24168148e-03 7.66000932e+01
1716.lowfreq: -12.0937 -7.6246 -7.2709 -0.0027 -0.0023 0.0008 54.7805 57.8728 80.6948
frequency: 54.7736 57.8184 80.6818 132.5651 151.7965 188.6620 197.0728 203.5932 206.9676 218.5863 222.6633 253.6069 268.9664 290.2055 311.0582 374.1811 405.9752 416.8080 466.6782 523.0597 534.8709 622.1063 622.6857 697.9053 750.4617 765.6623 873.1022 878.5119 923.6850 929.7273 960.1357 1008.2143 1046.3769 1056.0957 1080.6540 1117.7741 1165.0786 1223.0173 1237.5376 1296.3937 1320.5816 1350.7637 1377.6180 1380.4126 1396.3477 1401.0158 1428.7182 1459.6552 1466.4503 1466.9065 1476.2712 1479.9839 1492.9180 1536.9062 1594.9006 2988.5803 2990.4012 2990.6399 3038.9761 3071.5643 3077.9762 3081.4494 3102.6276 3104.5183 3110.7207 3165.4570
redmass: 5.1323 3.2380 5.8314 1.0961 2.6838 2.2419 1.2864 8.0176 1.6727 2.7192 14.1681 2.6975 3.3878 6.8406 24.3929 7.8560 4.8487 2.8819 4.2562 5.1624 4.6212 4.1825 5.6108 4.5922 6.5988 8.4526 1.3522 3.3885 1.1825 4.0300 1.4204 1.4963 1.5192 3.5084 1.7358 2.8562 2.1776 1.7310 5.5180 2.8699 1.2676 7.4622 1.1862 1.5394 1.2484 1.2399 3.8827 1.0449 1.1641 1.0432 1.0498 1.0459 1.0659 4.7523 8.6631 1.0359 1.0366 1.0367 1.0834 1.0974 1.0999 1.0992 1.0999 1.0997 1.0983 1.0927
irintensity: 0.9349 0.2577 0.5205 0.7786 0.4083 0.6725 0.0601 1.0483 0.4704 0.0925 0.1915 0.4641 1.7717 1.9169 0.0853 4.3860 0.2585 1.5995 1.1191 14.1568 3.0804 20.9637 0.3544 20.1363 0.4691 33.4383 15.3042 15.8824 4.2291 1.9263 0.0078 12.6428 8.8422 31.8478 71.6199 2.0284 6.4758 16.3823 14.9824 40.7195 0.5691 18.8633 20.1979 4.7383 2.5372 16.6201 24.5812 15.6271 47.2107 1.8042 2.8394 12.0385 13.5758 7.3751 13.7766 37.3993 52.0951 2.2288 4.2180 10.6557 17.0736 52.1041 15.1540 1.1857 30.0441 1.2891
temp: 298.150 k
press: 1.00000 atm
elementType: 17 17 17 6 6 6 6 6 6 6 6 6 6 1 1 1 1 1 1 1 1 1 1 1
symmnumber: 1
zpe: 473530.3 jmol-1
zpe.correction: 0.180358 hartree
zpe.thermalcorrener: 0.194754 hartree
zpe.thermalcorrenthalpy: 0.195698 hartree
zpe.thermalcorrgfe: 0.138697 hartree
zpe.sumelectzpe: -1766.872611 hartree
zpe.sumelectthermal: -1766.858215 hartree
zpe.sumelectthermalent: -1766.857271 hartree
zpe.sumelectthermalfe: -1766.914272 hartree
dipole: 0.1522 1.4132 0.0002
dipole: 1.4214
quadrupole: -98.3012 -93.8376 -99.7093
quadrupole: -9.0110 -0.0002 -0.0001
quadrupole: -1.0185 3.4451 -2.4266 -9.0110 -0.0002 -0.0001
hfenergy: -1767.0529693 hartree
pointgroup: C01 [X(C10H11Cl3)]
dipole: -0.1050335 -0.5492737 0.00001 debye
dipolederiv: -0.1118896 -0.068043 0.0000084 -0.0648805 -0.6988601 0.0000827 0.0000121 0.0000808 -0.0365715 -0.5030162 0.2940234 -0.0001211 0.3356445 -0.4625319 0.0001069 -0.0001625 0.0001237 -0.0748364 -0.5415423 0.2961993 -0.000053 0.340286 -0.283009 0.0000417 -0.0000514 0.0000374 -0.0308311 0.1136313 0.0231838 -0.0000068 0.1992157 0.1040654 0.0000058 0.0000445 0.0000101 0.1218094 0.0081392 0.1953226 -0.0000685 0.1288744 -0.3853967 0.0000784 -0.0000739 0.0000966 -0.0582146 -0.0499161 -0.0053381 0.039111 -0.0835626 0.0327049 0.0087319 -0.0424665 -0.0408644 -0.0265592 -0.0499536 -0.0053191 -0.0391455 -0.0835643 0.0325242 -0.0087024 0.0423949 0.0408832 -0.026579 -0.0128247 0.0260394 -0.000005 0.2184415 0.9162848 -0.000103 -0.0000325 -0.0001309 -0.0375365 0.6152309 -0.4197103 0.0001926 -0.5290488 0.6599068 -0.0002284 0.0002368 -0.0002492 -0.0510051 0.1723084 0.1970435 -0.0000194 0.187938 -0.0227775 0.0000094 0.0000155 0.0000173 0.0255464 0.5834003 -0.4414399 0.0000691 -0.696688 0.1805337 -0.0000472 0.0000945 -0.0000392 -0.0792828 -0.2692967 -0.01379 -0.0000296 0.1279628 -0.1044963 0.0000119 -0.0000539 0.0000263 -0.1306439 -0.1822592 -0.0471652 -0.000001 0.0092619 0.0892931 -0.000008 -0.0000361 -0.0000381 0.0450726 0.068523 0.0331805 0.0000168 -0.0325388 -0.0663905 -0.0000245 0.0000106 -0.0000185 0.0309883 0.1076773 0.0259288 0.0102601 0.0928682 -0.0842665 -0.0543165 -0.0163987 0.0108506 0.0775426 -0.1623546 -0.1114598 0.0355611 -0.1225172 0.0301928 -0.0000386 0.0270275 -0.0149489 0.0784197 0.0516704 0.0510129 -0.1181557 0.0332262 0.0706918 0.0494551 -0.0733219 0.03317 -0.1066842 0.0517061 0.0510115 0.1181372 0.0332088 0.0706828 -0.0494555 0.0732849 -0.0331823 -0.1067368 -0.1624398 -0.1114302 -0.0355463 -0.1224977 0.0302553 0.0000321 -0.0269972 0.0149448 0.0784444 0.107797 0.0259078 -0.0101994 0.0928948 -0.0841562 0.0543254 0.0164596 -0.0108341 0.0775541 0.0727024 -0.0202125 0.0000052 -0.0259433 -0.0319314 0.0000322 -0.0000032 0.0000408 0.1573657 0.0033438 -0.0164348 0.0635206 0.0047305 0.0731802 -0.075885 0.0966431 -0.031098 -0.0198594 0.0033496 -0.0164796 -0.0635156 0.0046636 0.0732271 0.0758349 -0.0966398 0.0310581 -0.0199417 0.0860131 0.057969 -0.000015 -0.0479756 -0.1397266 0.0000607 0.0000138 0.0000641 0.112539 unknown
polarizability: 179.0808061|-9.1602436|155.5319318|0.0050055|-0.0140265|76.6000957 unknown
InChI: InChI=1S/C10H11Cl3/c1-5(2)8-7(11)4-6(3)9(12)10(8)13/h4-5H,1-3H3
charge 0 multiplicity 1
24 atoms
Cl -0.168346 2.799104 -0.000333
Cl 1.834436 -2.497337 0.000644
Cl -3.112332 1.590901 -0.000258
C  2.205833 0.751179 -0.000058
C  0.79275 0.150889 -0.00004
C  3.000516 0.409286 -1.290237
C  3.000574 0.40886 1.289972
C  -0.365638 0.985029 -0.000133
C  0.500986 -1.238622 0.000187
C  -1.930953 -0.922684 0.000087
C  -1.681666 0.470619 -0.000092
C  -0.80027 -1.770106 0.000249
C  -3.33228 -1.494775 0.000139
H  2.076036 1.84705 0.0001
H  3.231139 -0.66551 -1.364625
H  3.956356 0.964312 -1.284472
H  2.439305 0.708404 -2.193487
H  2.439563 0.708025 2.193331
H  3.956601 0.963563 1.284174
H  3.23085 -0.666031 1.364163
H  -0.940582 -2.85447 0.00045
H  -3.899948 -1.158501 0.886346
H  -3.899822 -1.158955 -0.886324
H  -3.304508 -2.59643 0.000419
