program: Gaussian 09
title: 000182877
version: EM64L-G09RevD.01
frameworkgroup: C1[X(C20H14O7)]
method: RPBEPBE
basis: SDD
operation: Freq
keyword: #pfreq=noraman
keyword: PBEPBE/SDD
title: #p freq=noraman PBEPBE/SDD
converged: YES YES NO NO
title: Mulliken charges:
elementType: O O O O O O O C C C C C C C C C C C C C C C C C C C C H H H H H H H H H H H H H H
charge: -0.314343 -0.244109 -0.276307 -0.257326 -0.247533 -0.192772 -0.185278 0.263202 -0.035254 0.135225 0.207391 0.291937 -0.557986 0.390316 -0.240010 0.382757 0.192256 -0.438112 -0.441637 -0.376531 -0.314637 -0.248353 0.117845 -0.304073 0.118978 -0.499293 -0.502098 0.294394 0.280570 0.302377 0.265883 0.244781 0.253220 0.247496 0.255895 0.246700 0.230803 0.239004 0.243073 0.242237 0.229313
chargesum: 0.00000
title: Mulliken charges with hydrogens summed into heavy atoms:
elementType: O O O O O O O C C C C C C C C C C C C C C C C C C C C
charge: -0.314343 -0.244109 -0.276307 -0.257326 -0.247533 -0.192772 -0.185278 0.263202 -0.035254 0.135225 0.207391 0.291937 -0.263592 0.390316 0.040560 0.382757 0.192256 -0.135735 -0.175754 -0.131750 -0.061417 -0.000857 0.117845 -0.048178 0.118978 0.217214 0.212525
polarizability: 3.56857007e+02 -3.59595760e+01 2.65503861e+02 -1.80180420e+00 -6.08776836e+00 1.89816110e+02
1716.lowfreq: -6.6158 0.0006 0.0007 0.0007 0.2630 6.6893 12.4766 24.8050 26.9207
frequency: 11.7593 24.6387 26.8483 54.2415 61.9562 76.9805 90.1506 104.5499 108.8802 110.0678 163.9096 169.7834 176.7910 187.2159 201.5655 233.5171 244.1778 253.6628 261.2764 301.1182 319.8943 332.8099 340.3208 359.2389 380.1369 416.2185 418.4619 425.7471 454.2164 461.5994 470.1997 477.2385 499.9631 536.7558 585.0115 596.2682 604.0460 610.1608 614.5735 641.0747 655.6603 663.8040 703.0641 711.0197 715.4201 744.4359 745.2312 763.6854 777.3449 808.2404 820.6831 833.6767 836.4151 848.7300 856.2737 865.1211 872.4376 895.2653 949.4109 955.1490 967.8244 988.5317 997.3595 1034.5532 1038.2086 1063.3502 1086.6216 1101.0261 1109.5726 1110.2466 1146.1683 1151.5405 1160.4355 1171.1045 1173.7849 1190.2311 1242.1760 1245.9513 1246.4883 1261.6139 1320.5271 1363.1026 1381.7041 1385.2219 1399.8987 1403.9681 1426.1736 1438.9970 1451.7566 1453.8618 1455.0887 1467.6962 1469.0583 1472.6721 1489.5229 1540.1518 1554.4057 1593.9351 1607.3821 1613.8849 1621.3972 1692.9202 1695.3168 2994.3798 2995.7759 3102.2689 3105.3929 3123.7636 3124.1803 3135.8608 3141.4181 3166.6690 3173.8386 3182.2243 3188.6773 3191.5801 3197.4212
redmass: 7.0230 8.3195 5.9759 2.8768 3.1302 8.5477 7.5453 4.0448 5.1258 3.5249 1.9980 1.4897 3.8428 4.3573 1.8722 5.8078 9.0427 4.9481 5.0720 4.7716 5.8477 7.6965 5.8831 6.6867 8.7261 4.4374 4.5053 6.1702 2.9375 7.4181 6.9954 6.5157 6.6631 6.7953 5.8562 8.3886 5.8636 7.8973 4.7298 5.0676 4.9555 3.1839 7.8176 8.3509 7.1575 5.9629 4.4702 5.2438 8.0249 1.4234 5.7168 5.3228 1.6303 1.5954 1.6449 3.7442 1.8869 8.1264 5.7419 1.3253 4.3073 1.3274 1.2943 3.3226 2.8530 4.7519 2.6122 2.5449 1.2865 1.2931 1.4367 1.4382 1.5754 1.6670 1.9473 1.5581 2.5154 1.9792 2.0318 1.5526 4.1162 3.4260 4.3286 3.2197 2.6948 2.7445 5.6536 1.4963 1.3791 1.0992 1.0615 1.0687 1.0671 3.1044 3.2112 9.5919 8.7567 8.0854 7.1235 7.9155 7.2321 11.0353 10.9429 1.0289 1.0289 1.1053 1.1053 1.1049 1.1047 1.0907 1.0895 1.0884 1.0960 1.0925 1.0956 1.0975 1.0930
irintensity: 0.6115 0.6988 1.3688 4.4779 8.4330 1.2806 0.0738 3.5116 2.8182 9.0147 1.3316 0.4701 4.3672 1.2673 7.1782 0.7107 3.4001 1.7065 0.2009 10.7510 4.7583 3.3805 1.0221 7.6768 9.1268 0.4142 0.3371 2.1215 6.3130 2.5662 3.2486 11.3615 3.5036 4.8712 15.0110 7.8274 7.0850 1.8753 4.1898 12.6291 9.4318 1.1552 17.1176 7.1275 15.9257 23.3978 14.3806 10.1385 13.6066 0.3869 20.7740 31.4653 50.8064 80.5772 33.5697 5.0373 35.5680 15.2621 66.1094 0.6829 167.1677 0.2497 0.1649 86.4728 55.2650 146.9290 83.7838 128.0112 13.2736 10.1237 28.0622 12.3712 36.9474 16.6751 152.3435 27.1793 118.8469 44.9028 23.6180 53.4535 226.2231 61.6508 50.3255 41.4102 108.8420 94.9876 5.5953 14.0179 46.7516 22.4989 26.4747 21.0592 8.6566 19.8114 63.2009 80.5307 26.6257 121.1041 116.4065 441.0246 355.8109 397.0019 618.7930 50.8144 72.5386 26.6266 28.5633 33.7865 10.6416 9.9810 10.9802 2.4723 3.6784 1.2841 1.9609 2.2935 2.1888
temp: 298.150 k
press: 1.00000 atm
elementType: 8 8 8 8 8 8 8 6 6 6 6 6 6 6 6 6 6 6 6 6 6 6 6 6 6 6 6 1 1 1 1 1 1 1 1 1 1 1 1 1 1
symmnumber: 1
zpe: 771812.5 jmol-1
zpe.correction: 0.293968 hartree
zpe.thermalcorrener: 0.317462 hartree
zpe.thermalcorrenthalpy: 0.318406 hartree
zpe.thermalcorrgfe: 0.238838 hartree
zpe.sumelectzpe: -1295.160734 hartree
zpe.sumelectthermal: -1295.137241 hartree
zpe.sumelectthermalent: -1295.136297 hartree
zpe.sumelectthermalfe: -1295.215865 hartree
dipole: 6.0232 -9.7589 4.6773
dipole: 12.3852
quadrupole: -168.0650 -164.8132 -148.5897
quadrupole: -4.0280 -8.5333 7.4227
quadrupole: -7.5757 -4.3239 11.8996 -4.0280 -8.5333 7.4227
hfenergy: -1295.4547024 hartree
pointgroup: C01 [X(C20H14O7)]
dipole: -2.0622496 4.1049397 1.6247484 debye
polarizability: 352.5032439|-40.6859562|270.4250579|-2.921908|1.596401|189.2486772 unknown
InChI: InChI=1S/C20H14O7/c1-23-16-10-15-13(6-8-18(22)27-15)19(24-2)20(16)25-12-5-3-11-4-7-17(21)26-14(11)9-12/h3-10H,1-2H3
charge 0 multiplicity 1
41 atoms
O  0.052998 2.07687 0.066032
O  4.322589 -1.335553 -1.297158
O  1.625642 0.7419 2.139479
O  0.89406 1.629356 -2.714206
O  -2.96392 -1.745462 -0.13354
O  6.037006 -2.787184 -0.755153
O  -4.35633 -3.587723 -0.238407
C  2.980142 -0.26418 0.455957
C  1.171847 1.25093 -0.255074
C  1.906116 0.623418 0.779944
C  3.288065 -0.478301 -0.921322
C  1.544141 1.058052 -1.625237
C  2.598702 0.179634 -1.952287
C  -1.223697 1.471937 0.155497
C  3.766549 -0.951268 1.451446
C  -3.861927 0.485341 0.384142
C  -2.768953 -0.379815 0.0708
C  -1.447665 0.097815 -0.047216
C  -2.283061 2.367681 0.470466
C  -3.586824 1.868894 0.58106
C  4.790684 -1.799464 1.086997
C  -5.181617 -0.09783 0.480946
C  5.140376 -2.050713 -0.307727
C  -5.386227 -1.445439 0.280146
C  -4.293603 -2.362671 -0.039005
C  1.11724 2.014649 2.698017
C  0.263104 2.963872 -2.615054
H  2.872207 0.025041 -2.997528
H  3.525938 -0.784901 2.505072
H  -0.640559 -0.597384 -0.289617
H  -2.057355 3.427294 0.618338
H  -4.412935 2.547244 0.822079
H  5.394684 -2.328769 1.827807
H  -6.030171 0.55429 0.719336
H  -6.377431 -1.900056 0.349584
H  0.020791 2.075237 2.607255
H  1.583768 2.879618 2.195858
H  1.408454 1.982527 3.759253
H  -0.764004 2.887181 -2.222286
H  0.244067 3.330686 -3.652748
H  0.859307 3.639747 -1.978348
