program: Gaussian 09
title: 000182863
version: EM64L-G09RevD.01
frameworkgroup: C1[X(C16H15ClO4)]
method: RPBEPBE
basis: SDD
operation: Freq
keyword: #p
keyword: freq=noraman
keyword: PBEPBE/SDD
title: #p freq=noraman PBEPBE/SDD
converged: YES YES NO NO
title: Mulliken charges:
elementType: Cl O O O O C C C C C C C C C C C C C C C C H H H H H H H H H H H H H H H
charge: -0.072773 -0.252094 -0.284782 -0.256128 -0.202251 0.030626 0.265023 0.051080 0.245053 0.257718 0.163807 -0.256000 -0.398503 -0.392364 -0.213454 -0.343426 -0.147879 -0.221427 -0.533482 -0.535608 -0.542885 0.271697 0.245516 0.244241 0.224408 0.258748 0.257261 0.224569 0.219304 0.251865 0.228214 0.224592 0.244358 0.277642 0.224865 0.242468
chargesum: 0.00000
title: Mulliken charges with hydrogens summed into heavy atoms:
elementType: Cl O O O O C C C C C C C C C C C C C C C C
charge: -0.072773 -0.252094 -0.284782 -0.256128 -0.202251 0.030626 0.265023 0.051080 0.245053 0.257718 0.163807 0.015697 -0.152986 -0.148123 0.010955 -0.084678 -0.147879 0.035834 0.162256 0.161556 0.202090
polarizability: 2.26532220e+02 1.43114707e+01 2.08650383e+02 3.45654585e+00 6.06066972e+00 1.69411068e+02
1716.lowfreq: -6.1666 -0.0009 -0.0009 0.0010 6.0971 12.0763 17.4222 35.5998 48.1958
frequency: 17.2295 35.4699 48.1911 61.4685 83.4110 104.7388 109.6858 122.5744 136.7482 152.1246 165.6702 186.6936 209.3462 224.3235 238.3349 255.5453 269.0210 273.3982 290.1458 307.5241 331.0276 350.2653 352.8965 373.4640 417.8662 461.7984 484.1994 490.7208 533.2310 556.6127 569.6144 595.0778 612.0647 621.7131 667.3912 703.1096 712.2758 740.1734 759.8423 789.2887 797.8775 825.2592 841.1655 857.6584 893.4484 918.0093 952.4131 953.3157 971.2299 985.7630 1073.3500 1075.7091 1085.8463 1107.0845 1111.7588 1112.2858 1116.1730 1144.7572 1149.5893 1158.9248 1164.6283 1194.5276 1225.3534 1231.0251 1249.6992 1254.0282 1259.9716 1372.5013 1381.3238 1385.6602 1423.6729 1427.0508 1436.3729 1451.5575 1456.2274 1458.1156 1466.5191 1468.2522 1468.8358 1473.6159 1476.8212 1480.6226 1544.3834 1573.5699 1590.8083 1599.6873 1600.8842 2964.0018 2967.2671 2983.3156 3054.4425 3058.7309 3092.8323 3120.3222 3126.3881 3131.3330 3139.7659 3159.5683 3164.8068 3170.9718 3179.9055 3180.2238
redmass: 5.4201 6.1782 5.5083 3.1655 4.1399 3.8229 5.5116 6.0767 5.3245 6.0800 4.1904 1.6665 4.2892 2.8383 1.2159 1.8476 2.0495 2.2974 3.3654 3.4462 6.1432 6.3598 5.9078 5.8850 4.8453 4.8194 4.3703 6.1510 4.1436 4.7674 4.4964 4.9017 5.0433 6.5267 5.7325 3.2281 6.5740 1.9937 3.1357 5.8053 5.3642 1.5591 1.4394 5.4221 1.6123 5.9809 1.3077 1.3425 8.6349 9.5481 2.8539 5.6456 2.1369 1.7530 1.2575 1.2637 1.2603 1.7513 1.3507 1.3073 1.4196 1.1628 3.0600 2.4370 3.3615 1.6043 4.0988 3.2635 9.1218 10.2871 1.3727 1.5005 1.2466 1.3321 1.5154 1.8449 1.5423 1.1013 1.0530 1.0857 1.1068 1.2607 6.5979 9.6908 7.1664 7.3786 7.1869 1.0329 1.0323 1.0302 1.1040 1.1043 1.1025 1.1051 1.1003 1.0996 1.0875 1.0881 1.0916 1.0909 1.0977 1.0969
irintensity: 0.1493 1.9356 2.7309 4.2265 2.5901 0.7504 1.1874 4.4118 1.8468 4.4159 5.3682 0.1210 3.4383 0.6771 0.5495 0.2137 1.1868 1.8753 6.3810 1.7994 6.1612 0.3889 0.0715 1.9389 2.3221 6.6006 7.9973 3.7075 2.3801 19.2369 14.9619 3.3611 33.8209 18.5294 11.3965 9.5601 11.6663 43.0972 19.8515 5.9164 53.2767 50.2977 0.1187 3.1789 9.9751 65.3190 0.5762 1.0288 26.2636 6.5906 20.6240 253.5149 21.3373 29.1142 0.3078 0.3784 3.6375 5.5793 3.2257 3.5349 6.1215 7.9825 65.2628 205.5175 160.0315 28.6247 106.8226 39.1866 10.6416 13.7944 59.9861 19.7061 2.8098 63.3709 96.4799 42.3511 65.7066 22.1542 16.8214 22.0041 75.1201 11.4487 86.4567 110.8659 88.1738 153.6550 13.1100 71.8003 59.2927 43.5474 39.6331 36.9501 15.7408 25.6407 19.0246 17.5625 7.1841 1.4658 0.9305 11.8923 7.7616 10.2465
temp: 298.150 k
press: 1.00000 atm
elementType: 17 8 8 8 8 6 6 6 6 6 6 6 6 6 6 6 6 6 6 6 6 1 1 1 1 1 1 1 1 1 1 1 1 1 1 1
symmnumber: 1
zpe: 712708.1 jmol-1
zpe.correction: 0.271456 hartree
zpe.thermalcorrener: 0.292033 hartree
zpe.thermalcorrenthalpy: 0.292977 hartree
zpe.thermalcorrgfe: 0.221076 hartree
zpe.sumelectzpe: -1378.079278 hartree
zpe.sumelectthermal: -1378.058702 hartree
zpe.sumelectthermalent: -1378.057758 hartree
zpe.sumelectthermalfe: -1378.129659 hartree
dipole: 3.3109 -0.7875 3.1443
dipole: 4.6334
quadrupole: -113.3541 -119.3093 -126.4815
quadrupole: 10.2530 1.7670 -15.7158
quadrupole: 6.3608 0.4057 -6.7665 10.2530 1.7670 -15.7158
hfenergy: -1378.3507346 hartree
pointgroup: C01 [X(C16H15Cl1O4)]
dipole: 1.6585263 0.3956212 0.6448259 debye
polarizability: 220.4924438|-0.9411443|189.8368385|-22.3972233|-18.1699722|194.2643889 unknown
InChI: InChI=1S/C16H15ClO4/c1-19-12-8-7-10(17)9-11(12)16(18)15-13(20-2)5-4-6-14(15)21-3/h4-9H,1-3H3
charge 0 multiplicity 1
36 atoms
Cl -2.409601 3.842437 -0.982388
O  0.869197 -0.591037 -2.861275
O  1.024262 -0.166021 1.871603
O  -2.906084 -1.68069 1.371732
O  -0.560144 -2.187818 -0.665926
C  1.0121 -0.365126 -0.500336
C  -1.494425 -0.062763 0.024863
C  -0.374002 -0.96849 -0.380838
C  1.658945 -0.247668 -1.759922
C  1.725373 0.013177 0.666561
C  -2.683134 -0.47651 0.713133
C  -1.426233 1.280876 -0.453199
C  2.990557 0.231138 -1.854236
C  3.054763 0.498168 0.591392
C  3.669942 0.596357 -0.67385
C  -3.788291 0.414402 0.803071
C  -2.521512 2.139354 -0.328174
C  -3.723929 1.715004 0.279169
C  1.482273 -0.540839 -4.191088
C  1.672969 0.271969 3.111452
C  -1.795826 -2.519263 1.857169
H  -0.517261 1.614716 -0.961659
H  3.489027 0.327798 -2.821918
H  3.606516 0.784612 1.490144
H  4.698808 0.966663 -0.740715
H  -4.684997 0.06149 1.320558
H  -4.578881 2.392292 0.359927
H  2.350673 -1.22378 -4.256864
H  1.793693 0.489094 -4.452604
H  0.69251 -0.876181 -4.878422
H  1.917865 1.350459 3.076386
H  2.589739 -0.314964 3.311907
H  0.932117 0.085842 3.902782
H  -1.450492 -3.192955 1.056571
H  -2.225796 -3.085285 2.698187
H  -0.950519 -1.892758 2.197211
