program: Gaussian 09
title: 000017913
version: EM64L-G09RevD.01
frameworkgroup: C1[X(C4H2O4)]
method: RPBEPBE
basis: SDD
operation: Freq
keyword: #p
keyword: freq=noraman
keyword: PBEPBE/SDD
title: #p freq=noraman PBEPBE/SDD
converged: NO NO NO NO
title: Mulliken charges:
elementType: O O O O C C C C H H
charge: -0.365257 -0.330220 -0.160208 -0.129012 0.054168 0.066552 0.040704 0.024128 0.406181 0.392963
chargesum: 0.00000
title: Mulliken charges with hydrogens summed into heavy atoms:
elementType: O O O O C C C C
charge: 0.040925 0.062742 -0.160208 -0.129012 0.054168 0.066552 0.040704 0.024128
polarizability: 7.61029134e+01 -4.87178172e-01 7.31014416e+01 -4.89538748e-03 1.33874929e-03 2.20519390e+01
1716.lowfreq: -3.0660 -0.0011 -0.0003 0.0005 6.4642 12.4318 109.9012 192.5529 217.1551
frequency: 109.9002 192.5527 217.1549 256.4405 277.7544 447.0094 476.0756 547.1150 554.1792 583.3352 637.5423 743.8088 775.1214 911.1509 930.8967 1015.5654 1228.6903 1251.5933 1400.2422 1623.2375 1697.2407 1785.3642 3520.7392 3542.8517
redmass: 10.1137 5.9705 8.8727 7.7123 11.6490 1.1982 1.1633 6.9624 7.0152 12.0876 11.9932 6.4336 11.7205 11.2016 4.1907 2.5353 2.4784 1.6173 3.9161 8.9382 12.9046 11.1192 1.0665 1.0662
irintensity: 0.0019 11.6298 0.3062 4.4332 3.3738 342.0680 0.1881 30.9650 3.4597 1.1162 16.2872 20.9749 0.1932 65.1788 38.7319 111.9038 277.5087 182.3733 150.0966 493.7508 253.1691 45.4772 76.5880 95.3525
temp: 298.150 k
press: 1.00000 atm
elementType: 8 8 8 8 6 6 6 6 1 1
symmnumber: 1
zpe: 147891.7 jmol-1
zpe.correction: 0.056329 hartree
zpe.thermalcorrener: 0.063467 hartree
zpe.thermalcorrenthalpy: 0.064411 hartree
zpe.thermalcorrgfe: 0.024744 hartree
zpe.sumelectzpe: -453.872921 hartree
zpe.sumelectthermal: -453.865783 hartree
zpe.sumelectthermalent: -453.864839 hartree
zpe.sumelectthermalfe: -453.904506 hartree
dipole: 2.6633 5.8331 0.0006
dipole: 6.4124
quadrupole: -47.1634 -47.0610 -43.5356
quadrupole: 0.1209 -0.0081 0.0077
quadrupole: -1.2434 -1.1410 2.3844 0.1209 -0.0081 0.0077
hfenergy: -453.9292495 hartree
pointgroup: C01 [X(C4H2O4)]
dipole: 2.3264094 -0.9759233 -0.0001425 debye
dipolederiv: -0.7358271 0.7962855 0.0002355 0.6588294 -0.891482 -0.0004729 -0.0000872 -0.0001458 -0.3664431 -0.8865244 -0.8324334 0.0000541 -0.6951787 -0.6861649 -0.0001196 0.0003729 0.0001846 -0.3628052 -0.7876975 -0.4272435 0.0008748 -0.5564635 -0.8286154 0.0010951 0.0004359 0.0002531 -0.2708742 -0.7223457 0.473567 -0.000591 0.5252697 -0.8261376 0.0007775 0.0001198 -0.0002389 -0.256538 0.0684963 -1.0671694 -0.0000534 -1.1287101 0.6434382 0.0006185 0.0001843 0.000148 0.0632311 0.3885927 1.0610319 -0.0000116 1.2016549 0.5744983 -0.0000529 -0.0003388 -0.0004593 0.0831427 1.097841 0.8618273 -0.0013369 0.7414119 0.6470441 -0.0012601 -0.000557 -0.0003155 0.1257902 1.0358385 -0.8790055 0.0007756 -0.7438521 0.8000227 -0.0007979 -0.0001784 0.0002832 0.1251173 0.2528906 -0.140598 0.0001518 -0.1346738 0.3456209 0.000122 0.0000984 0.0001593 0.4265803 0.2887355 0.1537382 -0.0000988 0.1317122 0.2217757 0.0000903 -0.0000499 0.0001314 0.4327991 unknown
polarizability: 73.0740511|0.392927|76.1302952|-0.0156714|-0.0154814|22.0519477 unknown
InChI: InChI=1S/C4H2O4/c5-1-2(6)4(8)3(1)7/h5-6H
charge 0 multiplicity 1
10 atoms
O  1.676459 -1.647959 -0.001106
O  1.67313 1.630712 -0.000258
O  -1.681553 -1.685955 0.002119
O  -1.612683 1.73283 -0.001112
C  0.669159 -0.728376 -0.000494
C  0.713753 0.672615 -0.000305
C  -0.835394 -0.770318 0.00124
C  -0.793619 0.800963 -0.001244
H  1.321503 -2.5741 -0.000702
H  2.593045 1.257088 0.000162
