program: Gaussian 09
title: 000182833
version: EM64L-G09RevD.01
frameworkgroup: C1[X(C8H7F3N2OS)]
method: RPBEPBE
basis: SDD
operation: Freq
keyword: #p
keyword: freq=noraman
keyword: PBEPBE/SDD
title: #p freq=noraman PBEPBE/SDD
converged: YES YES NO NO
title: Mulliken charges:
elementType: S F F F O N N C C C C C C C C H H H H H H H
charge: 0.333972 -0.161350 -0.126278 -0.160624 -0.119225 0.009295 0.034744 -0.718319 0.155082 0.220482 -0.390386 0.345599 -0.280288 -0.767097 -0.258874 0.324101 0.324740 0.243527 0.263433 0.235459 0.237985 0.254023
chargesum: 0.00000
title: Mulliken charges with hydrogens summed into heavy atoms:
elementType: S F F F O N N C C C C C C C C
charge: 0.333972 -0.161350 -0.126278 -0.160624 -0.119225 0.009295 0.034744 -0.069478 0.155082 0.220482 -0.390386 0.345599 -0.036760 -0.030220 -0.004851
polarizability: 1.86722091e+02 -1.30094121e+01 1.21826046e+02 -4.77662039e-01 -3.42698955e-01 6.29872407e+01
1716.lowfreq: -43.2009 -12.1173 -5.6215 -3.2849 -0.0011 -0.0006 0.0010 8.6213 20.4351
frequency: -43.0614 6.7869 20.2481 40.7255 56.6885 79.8402 150.7057 155.6719 172.3520 196.5321 213.5912 252.0097 310.9972 373.5543 400.9089 427.5310 430.0745 430.8302 500.5233 532.7726 555.6444 573.1995 619.0890 691.9720 717.5286 776.1263 777.1261 839.7860 860.7297 869.0522 931.9591 978.9025 987.1012 997.8426 1001.8695 1047.9670 1066.0784 1082.7458 1126.3259 1168.2290 1188.6293 1241.6961 1269.6506 1282.5475 1304.4475 1388.6604 1392.9283 1398.0958 1452.8915 1465.7765 1517.3302 1545.6972 1667.8616 2990.2764 3022.7579 3069.4256 3076.4806 3126.2622 3143.2026 3177.2688
redmass: 1.0231 9.3911 5.3359 9.5514 8.3862 3.6242 6.0983 7.8843 9.6126 4.4793 7.8345 6.8619 8.5177 10.3378 4.3621 3.9105 7.1515 12.1909 14.4748 6.0794 2.8866 3.7204 13.7465 7.5801 9.1967 6.1546 7.7148 1.2449 5.1097 2.1082 8.9648 1.4043 1.6134 8.4544 4.0968 1.6177 10.7486 1.7222 1.1586 3.9738 3.0212 8.5186 2.9314 1.9010 2.7707 1.0799 1.3019 2.0443 1.1707 1.0468 3.9393 5.7258 11.0830 1.0385 1.0590 1.0969 1.1004 1.0986 1.0905 1.0975
irintensity: 0.5218 0.3740 0.3734 1.7509 0.0620 9.8269 3.3466 2.9017 1.8807 1.1547 0.7805 8.0674 1.5738 3.6708 6.6053 3.8390 0.4452 1.0179 5.6514 7.7272 0.2332 1.7251 44.8339 11.7830 30.0340 0.4485 12.0938 31.1825 21.3803 37.1372 15.1154 0.0024 24.1219 201.8654 155.2315 10.8810 161.1581 10.2247 7.9834 75.1287 134.1026 2.7381 1.3728 4.0706 136.1665 55.7614 25.5713 174.0722 40.2468 18.6306 111.8567 214.8919 99.8570 8.8117 21.7608 12.9085 0.3563 6.6501 11.5186 11.6127
temp: 298.150 k
press: 1.00000 atm
elementType: 16 9 9 9 8 7 7 6 6 6 6 6 6 6 6 1 1 1 1 1 1 1
symmnumber: 1
zpe: 371700.7 jmol-1
zpe.correction: 0.141573 hartree
zpe.thermalcorrener: 0.156010 hartree
zpe.thermalcorrenthalpy: 0.156954 hartree
zpe.thermalcorrgfe: 0.095540 hartree
zpe.sumelectzpe: -1190.231661 hartree
zpe.sumelectthermal: -1190.217225 hartree
zpe.sumelectthermalent: -1190.216281 hartree
zpe.sumelectthermalfe: -1190.277694 hartree
dipole: -5.6271 3.3663 -0.0416
dipole: 6.5573
quadrupole: -81.1746 -97.4437 -93.1976
quadrupole: -4.7056 0.0416 -0.2029
quadrupole: 9.4307 -6.8384 -2.5923 -4.7056 0.0416 -0.2029
hfenergy: -1190.3732344 hartree
pointgroup: C01 [X(C8H7F3N2O1S1)]
dipole: 2.3470221 0.193198 1.0534032 debye
dipolederiv: -0.5999885 -0.0737197 -0.1742477 -0.0491661 -0.01443 -0.0596552 -0.2825219 -0.0808732 0.0580724 -0.4449092 0.0756226 0.021182 0.0867293 -0.6933744 0.1743406 0.0365711 0.2462126 -0.405439 -0.970844 -0.1276112 -0.1375987 -0.1456559 -0.2905084 -0.0185126 -0.04933 0.0003169 -0.3255345 -0.4069203 -0.0094326 0.0928992 -0.0277939 -0.5442298 -0.2044139 0.1364291 -0.2637762 -0.5933411 -0.6241125 -0.0625986 -0.0881643 -0.0248191 -0.2382291 0.0667297 -0.2518282 0.028897 -0.5876202 -1.4277209 -0.225259 -0.1349225 -0.3001907 -0.2493559 0.0130322 0.1246441 0.0690586 -0.3320816 -0.8267666 -0.1197393 -0.0779179 0.0521837 -0.1805092 0.1319738 -0.7130055 -0.001527 -0.6921314 -0.302787 -0.0174317 -0.2124824 0.0884512 0.0812606 0.0165883 -0.5250511 -0.0552512 -0.1626424 1.0726488 0.1812439 0.1121425 0.104066 0.086698 -0.1279315 0.3851245 -0.0651764 0.7096339 0.9236442 0.1989119 -0.0814956 0.2240883 0.1577593 -0.1438674 -0.1933974 -0.1714461 0.5500514 1.7631833 0.2511704 0.4283054 0.1621164 0.0597123 -0.0313109 0.7634932 0.0374994 0.4602279 1.5991704 -0.0033608 0.0894351 0.0232088 1.5211594 0.0969239 -0.0418661 0.0697691 1.1704061 -0.3488901 -0.1016765 0.1864551 -0.1093266 -0.1763593 0.1315902 0.218044 0.1388484 -0.4554507 -0.3167098 -0.1119634 0.1669466 -0.0719511 -0.002865 0.0386443 0.0956179 0.0336569 -0.0250748 0.5646717 0.1456095 -0.0746718 0.0795021 0.0297399 -0.1425947 0.1720427 -0.0892574 0.4279385 0.0709697 0.0107489 0.0350502 -0.0386186 0.0801562 -0.0305856 0.1298682 -0.0240994 0.0362286 0.0836558 -0.0164641 0.009696 -0.0291243 0.0275737 0.0367846 0.1052702 0.0724767 0.0902657 -0.0503625 -0.0217061 -0.0872926 -0.0249193 0.158998 0.0060819 -0.0799638 0.0077364 0.0781517 0.105855 0.0250785 -0.086613 -0.0078163 0.1088312 0.0395553 0.0008214 0.0562286 -0.0433411 0.064704 -0.0736643 -0.0113003 -0.1060175 -0.0215578 -0.0484571 -0.0158087 -0.0910849 0.0299505 -0.0034667 0.0841992 0.032539 0.1112958 -0.0088704 0.0008504 0.0354123 0.0368336 0.0890721 0.0749751 -0.0079575 -0.0079443 0.0037578 0.1084007 0.0542337 -0.0505661 0.0449576 -0.0773421 unknown
polarizability: 184.1614166|23.1028849|71.1295484|8.7196992|-12.3721805|116.2444129 unknown
InChI: InChI=1S/C8H7F3N2OS/c1-5-2-3-12-7(13-5)15-4-6(14)8(9,10)11/h2-3H,4H2,1H3
charge 0 multiplicity 1
22 atoms
S  -0.131784 0.511999 -1.361331
F  -3.235872 -1.935908 1.248768
F  -4.958618 -0.910041 0.182077
F  -3.715037 0.245262 1.690606
O  -3.074715 -0.093207 -1.626676
N  2.491273 1.016064 -1.153517
N  1.428059 0.219387 0.895588
C  -1.246197 -0.100941 0.025886
C  -2.661806 -0.271986 -0.466781
C  3.698241 1.094533 -0.513858
C  1.426875 0.584117 -0.417287
C  -3.663395 -0.721306 0.654982
C  3.80743 0.735378 0.860433
C  4.883379 1.56652 -1.320469
C  2.642176 0.303901 1.521907
H  -1.2099 0.608628 0.871498
H  -0.854472 -1.057673 0.416043
H  4.764384 0.792886 1.38534
H  4.560179 1.83579 -2.336929
H  5.360636 2.445078 -0.848876
H  5.652841 0.775199 -1.389957
H  2.656524 0.013018 2.577656
