program: Gaussian 09
title: 000182825
version: EM64L-G09RevD.01
frameworkgroup: C1[X(C8H6F3NOS)]
method: RPBEPBE
basis: SDD
operation: Freq
keyword: #p
keyword: freq=noraman
keyword: PBEPBE/SDD
title: #p freq=noraman PBEPBE/SDD
converged: NO YES NO NO
title: Mulliken charges:
elementType: S F F F O N C C C C C C C C H H H H H H
charge: 0.279901 -0.159985 -0.160104 -0.121060 -0.107790 -0.007620 -0.754050 -0.056378 0.160689 0.349074 -0.149204 -0.217699 -0.346140 -0.309034 0.311780 0.311986 0.237028 0.246812 0.244254 0.247541
chargesum: 0.00000
title: Mulliken charges with hydrogens summed into heavy atoms:
elementType: S F F F O N C C C C C C C C
charge: 0.279901 -0.159985 -0.160104 -0.121060 -0.107790 -0.007620 -0.130285 -0.056378 0.160689 0.349074 0.087823 0.029112 -0.101886 -0.061493
polarizability: 1.65894771e+02 -9.80882297e+00 1.15940847e+02 -2.83201564e-01 -1.86176538e-01 5.50862484e+01
1716.lowfreq: -10.5883 -9.1894 -7.8394 0.0007 0.0011 0.0011 7.6550 21.9824 51.0012
frequency: -4.5923 21.8447 51.0012 57.9146 92.2434 164.9617 178.2318 181.6205 218.4128 275.5950 333.5426 367.1051 378.2143 404.6548 432.3259 491.2177 501.1184 573.4176 618.2365 656.4456 673.1164 719.9365 732.1300 779.5065 801.7529 856.3687 874.7799 951.2180 956.6100 967.9254 994.3224 996.4632 1057.2393 1067.7108 1086.9304 1091.2051 1145.1720 1170.6984 1227.9784 1280.4233 1296.2675 1328.1454 1396.7728 1412.0236 1454.1597 1543.1791 1553.3961 1672.3973 2996.6313 3059.3301 3132.4014 3136.6785 3159.9345 3166.8765
redmass: 4.8225 10.6357 15.3891 9.4275 3.2782 9.1895 7.6358 10.5492 7.4992 9.3868 9.0606 2.5143 12.9016 14.1734 9.9136 3.6247 14.6948 2.8707 13.5835 7.0184 7.8471 9.1307 3.7384 7.5517 1.3462 1.3123 1.7774 1.3587 7.2048 1.4714 4.2333 8.7290 3.0608 9.8683 2.7227 1.7268 1.1628 4.4112 1.2642 1.8071 3.6821 1.6162 1.8424 1.1141 1.7933 7.2540 5.2864 11.0179 1.0568 1.1027 1.0886 1.0888 1.0970 1.0963
irintensity: 0.7294 0.2852 0.4521 1.1841 11.9977 1.4081 0.6864 6.0088 0.5133 2.3134 1.6920 0.0030 3.8970 0.6490 1.5701 23.6072 6.0186 0.1163 33.4035 1.1802 36.2440 33.7434 0.1517 9.7232 62.4809 0.1279 38.7665 0.0662 2.2073 0.1603 154.4516 203.4560 8.8818 174.9050 16.8677 2.1060 5.8597 86.9126 5.9932 4.0930 7.3246 0.5396 21.2437 64.5047 23.5476 17.2829 171.5916 99.9211 15.9339 0.0105 15.0535 9.9259 19.5444 6.4474
temp: 298.150 k
press: 1.00000 atm
elementType: 16 9 9 9 8 7 6 6 6 6 6 6 6 6 1 1 1 1 1 1
symmnumber: 1
zpe: 333386.0 jmol-1
zpe.correction: 0.126980 hartree
zpe.thermalcorrener: 0.139493 hartree
zpe.thermalcorrenthalpy: 0.140437 hartree
zpe.thermalcorrgfe: 0.085645 hartree
zpe.sumelectzpe: -1134.953275 hartree
zpe.sumelectthermal: -1134.940762 hartree
zpe.sumelectthermalent: -1134.939818 hartree
zpe.sumelectthermalfe: -1134.994610 hartree
dipole: 0.3748 -0.7549 0.0152
dipole: 0.8430
quadrupole: -107.1042 -88.2918 -88.8928
quadrupole: 10.2540 -0.0514 -0.0839
quadrupole: -12.3413 6.4712 5.8701 10.2540 -0.0514 -0.0839
hfenergy: -1135.080255 hartree
pointgroup: C01 [X(C8H6F3N1O1S1)]
dipole: -0.173326 -0.1430222 0.2439252 debye
dipolederiv: -0.5302466 -0.0608975 0.095067 -0.0798009 -0.0049863 -0.0455217 0.1346759 -0.0435873 0.0580037 -0.4142104 -0.0011629 -0.0640967 0.0009364 -0.7985635 0.0395539 -0.0942213 0.1079161 -0.3231284 -0.4197988 0.0602141 -0.0175524 0.0818936 -0.3888275 -0.1507371 -0.0318768 -0.2193068 -0.727367 -0.9786214 -0.0749191 0.0984345 -0.0350351 -0.2746035 0.0274302 0.0217593 0.0253634 -0.3024889 -0.6004682 -0.0386866 0.0536453 -0.1195603 -0.297713 0.1553328 0.2015284 0.1590259 -0.4950213 -0.4885411 0.0059607 -0.018619 -0.0373058 -0.2906281 0.0820433 0.0608921 0.0836219 -0.3944011 -0.3215933 -0.1176867 0.1945143 -0.2760377 0.0402508 0.1017002 0.47504 0.1068905 -0.0766772 1.1389445 0.1657794 -0.265214 0.2335921 0.0080606 -0.0936813 -0.3918903 -0.0972016 0.113855 1.0787652 0.055727 -0.0529898 0.2031088 0.1962603 -0.2880505 -0.3197452 -0.293837 0.5642495 1.5916576 0.0436081 -0.0792616 -0.0117856 1.4481435 0.1587258 0.0256 0.1604866 1.2372545 -0.4049787 -0.1202196 0.2083514 -0.170057 -0.1371275 0.0759418 0.3018069 0.0781989 -0.2246623 -0.710938 -0.0162526 0.0097587 -0.0534053 -0.0662944 -0.0485822 0.0776412 -0.0472779 -0.0032949 0.3462973 0.0692775 -0.1133485 0.001461 0.0337667 -0.1813062 0.0094154 -0.1795072 0.2602409 0.4725737 -0.0536083 0.1136437 0.0813867 0.00971 -0.1470299 -0.1321791 -0.1514677 0.1979966 0.0560025 0.0191216 -0.0086939 0.0515087 -0.0021372 0.0335828 -0.1007823 0.0473989 0.080705 0.0571775 -0.0033758 -0.0180955 0.0575221 0.0949226 -0.0132926 -0.0943878 -0.0309388 -0.0168157 -0.0145876 0.0525466 -0.1002574 0.047354 0.1264984 0.0442037 -0.0903824 0.0444195 0.066133 0.121017 -0.0265693 0.0473865 -0.0068398 0.1130663 0.0904797 0.0112356 0.0900224 0.0001405 0.0662454 -0.0077553 0.0118547 -0.0069466 0.0793661 0.1029223 0.0103383 0.1030975 -0.0508132 -0.0446963 0.0488988 -0.0945273 0.0380111 0.1108357 0.0562851 -0.0744679 0.0566825 0.0360914 unknown
polarizability: 167.2125631|4.1590295|68.9138431|-3.6442053|-25.1044436|100.7954603 unknown
InChI: InChI=1S/C8H6F3NOS/c9-8(10,11)7(13)5-14-6-1-3-12-4-2-6/h1-4H,5H2
charge 0 multiplicity 1
20 atoms
S  -0.328997 0.655275 -1.354736
F  3.178213 -1.695418 0.747907
F  3.114374 0.30247 1.837978
F  4.645187 -0.049731 0.195262
O  2.669325 0.807929 -1.503472
N  -4.557181 -0.372739 0.391066
C  0.849089 -0.022922 -0.061086
C  -1.94009 0.214428 -0.598444
C  2.28411 0.237605 -0.469181
C  3.32967 -0.296712 0.570875
C  -2.114297 -0.46406 0.630948
C  -3.096733 0.595789 -1.325514
C  -3.431652 -0.729826 1.074059
C  -4.365468 0.282974 -0.794601
H  0.702196 -1.112943 0.058923
H  0.660795 0.455772 0.918345
H  -1.275213 -0.790804 1.250768
H  -3.019355 1.123595 -2.281598
H  -3.59346 -1.254357 2.022792
H  -5.274013 0.566875 -1.337094
