program: Gaussian 09
title: 000182808
version: EM64L-G09RevD.01
frameworkgroup: C1[X(C17H16N2O)]
method: RPBEPBE
basis: SDD
operation: Freq
keyword: #p
keyword: freq=noraman
keyword: PBEPBE/SDD
title: #p freq=noraman PBEPBE/SDD
converged: YES YES NO NO
title: Mulliken charges:
elementType: O N N C C C C C C C C C C C C C C C C C H H H H H H H H H H H H H H H H
charge: -0.242482 -0.196383 -0.022014 -0.414123 -0.380388 0.383705 -0.307119 -0.323417 0.262163 -0.076479 -0.592407 -0.334151 0.386201 0.414696 -0.549873 -0.393726 -0.433280 -0.408255 -0.242791 -0.242309 0.257157 0.234619 0.213478 0.234355 0.221863 0.191920 0.197011 0.222784 0.258103 0.236015 0.268006 0.233418 0.240195 0.245711 0.228537 0.229258
chargesum: 0.00000
title: Mulliken charges with hydrogens summed into heavy atoms:
elementType: O N N C C C C C C C C C C C C C C C C C
charge: -0.242482 -0.196383 -0.022014 0.077654 0.067445 0.383705 0.106665 0.096379 0.262163 -0.076479 -0.334304 -0.098136 0.386201 0.414696 -0.281867 -0.160308 -0.193085 -0.162543 -0.014254 -0.013051
polarizability: 3.14939411e+02 3.62168245e+01 2.44318426e+02 -5.19096734e+00 4.44873493e+00 1.01491422e+02
1716.lowfreq: -13.9691 -7.4198 -0.0007 -0.0003 0.0004 8.6852 48.2915 59.6312 65.7321
frequency: 48.2834 59.5534 65.6392 100.9466 129.6342 185.3181 215.5978 238.6365 252.7524 272.6993 289.2657 319.1465 327.8826 394.3940 397.6504 423.5794 457.0295 479.7062 486.9009 505.0796 509.0321 549.2395 585.7125 607.3430 619.8405 639.8029 653.8023 700.7342 758.2420 762.7714 772.0146 789.2728 797.7283 815.8968 829.8238 843.8839 860.2543 891.4089 902.7491 910.1305 912.8398 925.5589 945.9784 969.0129 990.5947 1005.7534 1014.5033 1021.9132 1052.9990 1063.0179 1072.6765 1078.5686 1104.0936 1141.3604 1155.8605 1164.9610 1171.1817 1191.7708 1218.3779 1239.4858 1247.2492 1261.1502 1276.0735 1280.7562 1309.5416 1331.8918 1341.5646 1346.5097 1356.5673 1363.1667 1370.4029 1381.4170 1397.6680 1410.1609 1437.0700 1444.9152 1447.2186 1452.7852 1454.4892 1465.8822 1480.5805 1528.9196 1553.9347 1567.6585 1603.4336 1637.5881 2914.6849 2928.7563 2953.2612 2959.7182 3052.9656 3083.6084 3086.9422 3090.2982 3113.6968 3118.9484 3126.9167 3132.7917 3143.7659 3150.9327 3162.5725 3164.9046
redmass: 4.7018 4.8937 3.2882 4.7073 4.4249 4.7230 4.1630 3.0260 4.3752 3.9028 2.9291 3.9363 4.4127 5.7048 2.2611 2.8824 2.7331 2.6386 5.4908 3.7805 3.9914 4.7148 3.8404 3.5000 4.7057 4.2467 4.6919 4.4692 1.3162 4.6494 3.7988 2.6036 3.9432 4.1128 1.4987 1.5702 1.4434 5.0419 2.2030 1.9810 2.7772 1.8359 1.4514 1.4101 1.3455 2.8315 2.2909 2.2153 1.9872 2.3402 2.7090 4.1490 2.2035 1.7875 3.1401 1.5507 1.0835 1.0708 1.4241 1.4365 1.5785 1.7981 1.6139 1.2629 2.4709 1.3001 1.4440 1.9872 2.4095 1.4665 1.2801 2.1600 3.5282 2.6190 6.1554 1.0897 2.3443 1.2462 1.1079 1.1453 2.8364 5.9175 5.9005 6.1731 6.4814 6.8837 1.0684 1.0713 1.0671 1.0665 1.0927 1.0965 1.0977 1.0901 1.0896 1.0865 1.0881 1.0901 1.0952 1.0919 1.1003 1.0932
irintensity: 0.4936 0.3749 1.1036 1.4750 2.5202 3.7082 3.7674 2.0459 3.7253 3.2251 6.1674 8.2137 1.5130 0.6382 0.9228 1.1515 2.7482 17.9655 8.8271 9.8966 2.2076 0.8640 5.3589 8.4331 4.2465 5.7960 3.5461 9.9117 58.6840 2.9434 0.6021 3.0655 8.1290 3.6727 16.4835 7.8103 0.3637 59.6481 49.5667 10.0028 26.5244 3.4095 4.3789 11.7784 0.1817 25.2658 5.6661 18.3808 28.2761 2.4772 5.1707 44.1192 4.6655 19.2924 6.0204 3.3909 0.3616 5.6978 39.9418 45.6204 13.0031 26.3556 5.4221 7.4268 5.6590 7.0069 5.0406 4.1993 39.4020 16.7029 0.8706 29.1583 21.7646 24.2692 20.4133 3.4098 29.6598 14.1966 3.5842 31.4433 42.3504 106.6135 45.9894 80.9072 18.9644 3.3136 67.7203 57.1978 44.6795 87.5764 23.4734 34.1483 39.2166 11.0555 33.5714 2.3374 0.1530 6.8059 30.5357 4.1620 47.1039 18.6522
temp: 298.150 k
press: 1.00000 atm
elementType: 8 7 7 6 6 6 6 6 6 6 6 6 6 6 6 6 6 6 6 6 1 1 1 1 1 1 1 1 1 1 1 1 1 1 1 1
symmnumber: 1
zpe: 764552.8 jmol-1
zpe.correction: 0.291203 hartree
zpe.thermalcorrener: 0.306470 hartree
zpe.thermalcorrenthalpy: 0.307414 hartree
zpe.thermalcorrgfe: 0.248713 hartree
zpe.sumelectzpe: -840.714572 hartree
zpe.sumelectthermal: -840.699305 hartree
zpe.sumelectthermalent: -840.698361 hartree
zpe.sumelectthermalfe: -840.757063 hartree
dipole: 1.3176 -1.9795 -0.3092
dipole: 2.3980
quadrupole: -108.4169 -118.5975 -119.5307
quadrupole: 13.8796 -4.0746 -0.2166
quadrupole: 7.0982 -3.0825 -4.0157 13.8796 -4.0746 -0.2166
hfenergy: -841.0057752 hartree
pointgroup: C01 [X(C17H16N2O1)]
dipole: -0.4982339 -0.7998255 0.0459391 debye
polarizability: 315.3215798|-32.9944409|241.615726|-19.0114523|14.3650616|103.8119537 unknown
InChI: InChI=1S/C17H16N2O/c1-2-4-14-12-16-15(11-13(14)3-1)17(5-6-18-16)19-7-9-20-10-8-19/h1-6,11-12H,7-10H2
charge 0 multiplicity 1
36 atoms
O  -4.434428 -2.08764 -0.263548
N  -2.348211 -0.121183 0.152239
N  0.510828 3.11702 0.247078
C  -2.3944 -0.953902 -1.086703
C  -3.709367 0.096438 0.696047
C  -1.408308 0.934065 0.226822
C  -3.074599 -2.297931 -0.789776
C  -4.37515 -1.268053 0.957077
C  0.021644 0.652167 0.114747
C  0.936368 1.792933 0.084996
C  0.562747 -0.653949 0.103697
C  -1.789124 2.266274 0.454562
C  1.95634 -0.884393 -0.028966
C  2.858676 0.255535 -0.147165
C  2.323142 1.564578 -0.070627
C  -0.801135 3.30351 0.459323
C  2.512395 -2.213012 -0.045635
C  4.270502 0.010837 -0.300614
C  3.882441 -2.411914 -0.192828
C  4.77036 -1.287843 -0.325674
H  -1.377466 -1.109071 -1.478731
H  -2.981385 -0.418027 -1.866616
H  -4.340192 0.685359 -0.009423
H  -3.637115 0.653235 1.647515
H  -3.203883 -2.890136 -1.710326
H  -2.472289 -2.874952 -0.054416
H  -3.809929 -1.809593 1.74586
H  -5.422499 -1.137532 1.275537
H  -0.102151 -1.513008 0.247336
H  -2.840262 2.545604 0.566044
H  2.977058 2.442371 -0.103996
H  -1.122695 4.342598 0.606043
H  1.835633 -3.070419 0.053762
H  4.946019 0.869107 -0.39452
H  4.293517 -3.42725 -0.208873
H  5.845417 -1.462723 -0.44325
