program: Gaussian 09
title: 000182807
version: EM64L-G09RevD.01
frameworkgroup: C1[X(C20H23N3)]
method: RPBEPBE
basis: SDD
operation: Freq
keyword: #pfreq=noraman
keyword: PBEPBE/SDD
title: #p freq=noraman PBEPBE/SDD
converged: YES YES NO NO
title: Mulliken charges:
elementType: N N N C C C C C C C C C C C C C C C C C C C C H H H H H H H H H H H H H H H H H H H H H H H
charge: -0.063193 -0.432058 -0.035843 -0.042520 -0.429751 -0.465335 -0.400745 -0.355198 -0.294628 0.353664 -0.701827 0.305222 -0.337316 -0.070776 -0.598890 0.390882 0.414342 -0.561342 -0.394921 -0.435267 -0.410989 -0.246921 -0.242543 0.232374 0.192839 0.244561 0.155486 0.239164 0.209530 0.201184 0.214850 0.169068 0.293780 0.176975 0.207943 0.230319 0.214938 0.215557 0.226008 0.197202 0.267856 0.229259 0.236824 0.245375 0.227015 0.227848
chargesum: 0.00000
title: Mulliken charges with hydrogens summed into heavy atoms:
elementType: N N N C C C C C C C C C C C C C C C C C C C C
charge: -0.063193 -0.138278 -0.035843 0.189854 0.007649 -0.070685 0.009969 0.028720 0.090290 0.353664 -0.041014 0.305222 -0.111309 -0.070776 -0.401688 0.390882 0.414342 -0.293486 -0.165662 -0.198443 -0.165614 -0.019907 -0.014695
polarizability: 3.80512593e+02 3.87303115e+01 2.73688585e+02 -9.66221962e-01 -1.47383753e+01 1.34869300e+02
1716.lowfreq: -12.5777 -3.8343 -0.0006 0.0002 0.0004 4.4027 24.1856 26.9446 42.6692
frequency: 24.1202 26.9093 42.6204 62.2575 79.4160 96.5879 124.1180 137.7876 171.9386 184.3568 202.8361 231.1123 247.8340 255.7318 277.2966 290.2077 308.3823 352.0860 384.1342 388.9534 398.3910 413.0200 418.6735 454.1449 472.4415 476.9557 493.0718 508.3936 543.9907 574.4223 581.6925 602.3093 621.7105 628.3076 661.6221 731.7716 753.2634 755.7964 767.9542 781.0569 797.1121 802.5209 814.7982 828.8825 846.8721 853.7780 863.8683 883.3873 905.3036 908.4940 923.4915 944.8231 947.1338 956.6852 966.1059 979.0863 988.7577 1013.9551 1018.5578 1054.5653 1068.2477 1080.6701 1092.7473 1111.8146 1118.6019 1133.7644 1145.5007 1151.5777 1160.3653 1168.2780 1171.5870 1193.3410 1230.4760 1235.4385 1244.5966 1262.3047 1274.9493 1280.6131 1285.0467 1303.2539 1309.0261 1316.9751 1326.2972 1337.5095 1344.5722 1352.1070 1357.6874 1364.4451 1372.6511 1389.0335 1396.0117 1396.5964 1416.8911 1435.4890 1445.0252 1457.9243 1458.1918 1466.2122 1469.6952 1471.1462 1472.7630 1476.9015 1491.7422 1503.2306 1546.4158 1559.6404 1577.8470 1609.0814 1639.1060 2775.1393 2821.6003 2844.4376 2974.0749 2987.7433 2991.4982 3009.1806 3013.4872 3031.6166 3047.9265 3054.1198 3059.2347 3081.0451 3092.7645 3098.8641 3110.3072 3116.6828 3126.4314 3142.5226 3151.3021 3161.3345 3169.7301 3555.1215
redmass: 3.6659 4.2589 3.5312 3.3689 2.8103 4.4462 2.1361 3.5232 4.2247 4.3285 2.1685 1.6344 3.3569 3.3577 2.4659 2.8640 2.9986 2.1225 5.8047 2.1876 3.4062 3.8108 1.9566 2.5454 2.6832 2.4738 3.0388 3.4637 5.8135 3.7079 3.6772 4.2679 6.3888 4.0163 5.5605 4.6300 1.3098 2.8628 3.6169 1.9722 2.5557 1.3623 1.4867 2.6211 1.5826 4.3995 1.4387 1.7041 2.2589 5.2150 1.7415 1.4518 1.7354 2.4326 1.4057 1.8359 1.3464 2.5983 2.7648 2.0570 2.3582 2.1077 2.0866 2.4646 2.4204 1.9424 1.3518 2.0290 1.9928 1.4673 1.0982 2.2082 1.5291 1.6122 1.7048 1.4617 1.3729 1.2624 1.5514 1.4899 1.9884 1.3138 1.5261 1.8159 1.5320 1.5333 1.8547 1.5259 2.0175 1.2467 3.2594 1.6030 2.2446 4.4134 3.4217 1.0883 1.0894 1.0901 2.4762 1.0520 1.0858 1.0720 1.0731 3.0148 4.1239 5.4531 6.0431 5.8951 6.8234 1.0701 1.0714 1.0706 1.0645 1.0359 1.0610 1.0830 1.0876 1.0872 1.0979 1.0918 1.0987 1.0983 1.1005 1.0892 1.0897 1.0864 1.0876 1.0952 1.0918 1.1004 1.0929 1.0754
irintensity: 0.0699 0.1867 0.0028 0.3615 0.7231 0.8966 1.3044 0.1627 0.3459 0.5654 0.7690 1.7152 0.1417 0.9307 1.5685 0.8360 3.3768 4.1544 0.8213 10.3856 9.2764 12.9828 28.7942 2.9147 18.0864 36.9881 5.7575 0.1623 0.3810 14.8100 1.4702 3.4950 2.5061 0.6163 0.6427 8.6913 49.5741 3.0274 0.4358 4.7028 1.8074 2.0339 31.5476 13.1368 9.6416 22.3940 1.4563 48.9021 2.5738 1.3134 9.1514 4.4289 8.1145 6.6172 10.8355 0.3614 0.3438 9.9410 3.1268 5.6674 1.8467 6.8198 54.3532 3.1207 11.5284 6.6820 5.8376 4.0322 81.0788 1.3719 0.0509 15.6477 2.2853 4.5454 7.5008 1.9995 12.3220 10.6704 3.0240 11.8821 6.9547 7.7493 24.2824 5.3027 10.5288 8.6270 46.0486 27.6714 53.6453 16.2032 27.6220 42.4357 26.2535 3.5362 0.9406 10.9786 6.8187 6.0616 0.4810 8.8988 12.3346 4.6531 9.6065 90.8665 338.4623 149.4674 180.5484 33.2410 5.1912 89.7221 72.1910 162.0076 20.2360 31.6707 34.3328 17.9234 16.0471 38.6973 22.7098 52.1774 47.2950 49.0095 36.0809 19.6250 35.5120 4.7076 0.1985 31.3265 4.2760 47.4370 32.9107 23.2818
temp: 298.150 k
press: 1.00000 atm
elementType: 7 7 7 6 6 6 6 6 6 6 6 6 6 6 6 6 6 6 6 6 6 6 6 1 1 1 1 1 1 1 1 1 1 1 1 1 1 1 1 1 1 1 1 1 1 1
symmnumber: 1
zpe: 1015123.6 jmol-1
zpe.correction: 0.386640 hartree
zpe.thermalcorrener: 0.406597 hartree
zpe.thermalcorrenthalpy: 0.407541 hartree
zpe.thermalcorrgfe: 0.337191 hartree
zpe.sumelectzpe: -938.528798 hartree
zpe.sumelectthermal: -938.508841 hartree
zpe.sumelectthermalent: -938.507897 hartree
zpe.sumelectthermalfe: -938.578247 hartree
dipole: 4.2704 -3.8748 1.3416
dipole: 5.9203
quadrupole: -123.8412 -135.5655 -142.3668
quadrupole: 7.4768 1.3807 0.7268
quadrupole: 10.0833 -1.6410 -8.4423 7.4768 1.3807 0.7268
hfenergy: -938.9154383 hartree
pointgroup: C01 [X(C20H23N3)]
dipole: -1.6624818 1.5685062 0.4486631 debye
polarizability: 380.1526377|38.5311167|275.0720053|-11.3055018|0.7475112|133.8458349 unknown
InChI: InChI=1S/C20H23N3/c1-2-23-11-5-8-17(14-23)22-19-9-10-21-20-13-16-7-4-3-6-15(16)12-18(19)20/h3-4,6-7,9-10,12-13,17,22H,2,5,8,11,14H2,1H3
charge 0 multiplicity 1
46 atoms
N  -4.790768 0.70986 -0.196595
N  -1.10578 -0.018511 0.121356
N  1.994823 -2.959976 -0.331933
C  -2.54693 -0.304229 0.21635
C  -2.987409 -0.702474 1.649073
C  -3.331714 0.943372 -0.252041
C  -4.520126 -0.881966 1.701552
C  -5.236732 0.380252 1.180958
C  -5.546727 1.833062 -0.812655
C  -0.111573 -0.970551 -0.022249
C  -7.027233 1.503479 -1.076655
C  1.292119 -0.553145 -0.090495
C  -0.38355 -2.349768 -0.119894
C  2.303598 -1.598466 -0.237318
C  1.708368 0.795645 -0.026726
C  3.078354 1.163005 -0.085512
C  4.086167 0.118962 -0.219314
C  3.668453 -1.231976 -0.293921
C  0.689621 -3.27785 -0.277453
C  3.505261 2.536609 -0.019484
C  5.475341 0.499129 -0.276579
C  4.856305 2.86774 -0.078258
C  5.852113 1.837127 -0.20763
H  -2.793337 -1.127308 -0.481115
H  -2.679885 0.102689 2.347872
H  -2.465907 -1.623573 1.967361
H  -3.023925 1.818226 0.39001
H  -3.048979 1.180399 -1.294407
H  -4.820133 -1.744356 1.075573
H  -4.846462 -1.092009 2.737578
H  -6.32671 0.21016 1.168911
H  -5.037269 1.235541 1.881811
H  -0.82781 0.948945 0.286656
H  -5.4751 2.761927 -0.187975
H  -5.057133 2.061305 -1.778805
H  -7.111175 0.567476 -1.656279
H  -7.606899 1.387287 -0.143775
H  -7.49756 2.318492 -1.65663
H  -1.405144 -2.733981 -0.070589
H  0.979745 1.612835 0.061401
H  4.399094 -2.040508 -0.402318
H  0.453259 -4.34714 -0.354511
H  2.746103 3.322453 0.079255
H  6.231337 -0.288537 -0.376459
H  5.171032 3.915868 -0.02629
H  6.910779 2.115776 -0.252053
