program: Gaussian 09
title: 000015566
version: EM64L-G09RevD.01
frameworkgroup: C1[X(C18H15O2P)]
method: RPBEPBE
basis: SDD
operation: Freq
keyword: #p
keyword: freq=noraman
keyword: PBEPBE/SDD
title: #p freq=noraman PBEPBE/SDD
converged: YES YES NO NO
title: Mulliken charges:
elementType: P O O C C C C C C C C C C C C C C C C C C H H H H H H H H H H H H H H H
charge: 1.075964 -0.547659 -0.624078 -0.108644 -0.115807 -0.299554 -0.235686 -0.238037 -0.295246 0.388475 -0.207453 -0.222343 -0.223828 -0.206206 -0.221576 -0.222907 -0.347909 -0.384508 -0.201083 -0.194545 -0.253993 0.280620 0.240059 0.252462 0.285281 0.236024 0.234789 0.234346 0.235779 0.234072 0.234218 0.294668 0.243272 0.227435 0.226165 0.227434
chargesum: 0.00000
title: Mulliken charges with hydrogens summed into heavy atoms:
elementType: P O O C C C C C C C C C C C C C C C C C C
charge: 1.075964 -0.547659 -0.624078 -0.108644 -0.115807 -0.018934 0.004373 0.014424 -0.009965 0.388475 0.028571 0.012447 0.010518 0.029573 0.012497 0.011311 -0.053241 -0.141236 0.026352 0.031620 -0.026560
polarizability: 2.54819374e+02 -1.61410425e+01 1.81499067e+02 3.87723631e+00 1.79905063e+01 2.06307324e+02
1716.lowfreq: -6.7598 -6.2110 -0.0016 -0.0014 -0.0014 7.8678 14.6729 23.5439 27.8125
frequency: 13.2023 23.2538 27.7691 38.4907 46.8727 61.4919 115.4934 135.9158 165.1041 198.7401 215.0029 228.0272 241.5650 277.5449 292.7436 383.1218 395.5841 399.4671 409.4187 427.1733 442.2147 490.5203 504.7511 516.4009 553.8427 604.9873 610.5830 612.0481 645.0044 681.2107 693.3347 698.7445 704.7644 706.9193 760.8150 761.6818 768.0281 825.0556 836.5407 857.2736 863.8036 910.6030 933.2575 940.1766 968.6490 983.0721 984.2373 986.5119 986.8107 986.9224 988.0684 999.4358 1005.4793 1006.1773 1020.9985 1021.9214 1023.3556 1076.8841 1078.6952 1083.3480 1089.3809 1098.6579 1165.1505 1174.5264 1175.4027 1176.0598 1186.3704 1189.6423 1196.1728 1308.3524 1313.0464 1314.5652 1379.7368 1380.2732 1382.6969 1426.1610 1429.2007 1441.2867 1464.6385 1467.6385 1473.2503 1587.3454 1590.6073 1592.7970 1595.5069 1597.7461 1604.0901 3127.9602 3129.8492 3130.8112 3136.7157 3137.4799 3140.0742 3146.0920 3150.2848 3150.4960 3156.4078 3159.6067 3161.7893 3168.9079 3170.5376 3171.9715
redmass: 3.7211 4.5960 4.6620 4.3037 4.9993 5.3502 6.1451 5.8940 5.9552 5.2570 5.6014 5.4388 6.2150 7.0950 6.4534 7.9719 2.7969 2.8297 2.9439 7.0307 4.6524 4.3481 4.4059 4.1616 6.9151 6.7895 6.4562 6.4788 8.4637 6.9680 2.1586 2.3185 1.9409 3.9282 1.7139 1.5736 1.6726 6.9443 1.2578 1.2501 1.2433 1.4220 1.3728 1.3827 1.3610 6.7263 1.4268 3.8983 2.8150 1.6093 1.7074 8.3124 1.3323 1.3320 2.8727 2.1623 2.8001 1.6038 1.5336 1.7400 2.6820 2.8574 1.1739 1.0569 1.1016 1.3332 1.1459 1.2140 1.6600 1.3256 1.3315 1.3102 8.4825 8.3081 9.1673 2.1109 2.1306 2.3115 2.0564 2.0552 2.2089 6.1199 6.1509 6.4251 5.8786 5.8629 6.2615 1.0848 1.0851 1.0853 1.0891 1.0879 1.0886 1.0925 1.0932 1.0936 1.0968 1.0964 1.0965 1.1017 1.1010 1.1007
irintensity: 0.0555 0.3209 0.3279 0.1415 0.7203 0.9186 2.0032 1.4443 2.5483 2.5906 7.4424 4.9224 2.2859 7.5903 2.6066 4.5051 0.1736 0.4466 0.1688 24.0531 16.3983 9.0743 74.9814 95.2626 64.7182 23.9449 0.0786 0.6660 47.1701 34.9596 26.7494 7.3278 101.9838 77.4564 11.8995 108.5347 18.4041 212.6680 3.2324 0.2895 0.2423 13.3769 0.0589 1.2363 0.2700 13.4623 0.3090 2.7349 4.8607 0.4199 0.9437 44.5084 0.3062 0.2402 2.7802 18.7441 13.7941 1.6532 14.3311 14.9494 49.4723 40.1318 37.5073 0.5105 18.4425 84.6689 11.2880 52.0094 101.0743 0.9423 3.6847 4.2878 0.5562 3.0723 1.4665 0.7737 37.4564 7.8665 8.1066 12.6587 135.5556 0.0615 3.2387 28.3924 0.6630 0.6988 75.3529 0.9242 0.1378 0.2442 12.8774 4.7465 6.7323 6.8156 8.5325 10.8210 14.6948 24.7641 24.2668 29.4265 18.2948 18.4213
temp: 298.150 k
press: 1.00000 atm
elementType: 15 8 8 6 6 6 6 6 6 6 6 6 6 6 6 6 6 6 6 6 6 1 1 1 1 1 1 1 1 1 1 1 1 1 1 1
symmnumber: 1
zpe: 725286.3 jmol-1
zpe.correction: 0.276247 hartree
zpe.thermalcorrener: 0.294630 hartree
zpe.thermalcorrenthalpy: 0.295574 hartree
zpe.thermalcorrgfe: 0.225990 hartree
zpe.sumelectzpe: -1185.122395 hartree
zpe.sumelectthermal: -1185.104012 hartree
zpe.sumelectthermalent: -1185.103068 hartree
zpe.sumelectthermalfe: -1185.172652 hartree
dipole: 1.2197 2.3211 -3.5113
dipole: 4.3823
quadrupole: -110.8290 -123.6986 -123.9620
quadrupole: -5.0327 -0.3942 5.3494
quadrupole: 8.6675 -4.2020 -4.4655 -5.0327 -0.3942 5.3494
hfenergy: -1185.3986418 hartree
pointgroup: C01 [X(C18H15O2P1)]
dipole: 0.5745278 0.7775938 -1.4275483 debye
polarizability: 252.1033017|-20.7310603|186.5409322|7.7799003|18.618796|203.9815311 unknown
InChI: InChI=1S/C18H15O2P/c19-21(17-12-6-2-7-13-17,18-14-8-3-9-15-18)20-16-10-4-1-5-11-16/h1-15H
charge 0 multiplicity 1
36 atoms
P  0.504199 -0.071817 0.848541
O  -0.502913 -1.193703 -0.086668
O  0.307943 -0.001101 2.439127
C  2.14976 -0.75522 0.338282
C  0.139538 1.568711 0.045046
C  3.180634 -0.725594 1.306376
C  -0.00229 1.697516 -1.356274
C  2.38073 -1.281857 -0.95351
C  0.019029 2.693749 0.893468
C  -1.91975 -1.199598 -0.011746
C  4.462108 -1.215862 0.969854
C  -0.263226 2.969304 -1.912001
C  3.664416 -1.771753 -1.280862
C  -0.241192 3.962896 0.329941
C  4.705504 -1.733743 -0.323396
C  -0.378481 4.101358 -1.070798
C  -2.631703 -0.772603 1.13479
C  -2.595381 -1.70578 -1.145431
C  -4.043081 -0.844384 1.124342
C  -4.005163 -1.780367 -1.13298
C  -4.735819 -1.345722 -0.001633
H  2.967804 -0.34092 2.310137
H  0.065605 0.81764 -2.005242
H  1.563824 -1.34061 -1.679184
H  0.116052 2.559445 1.976715
H  5.264442 -1.198301 1.715103
H  -0.380623 3.076663 -2.995696
H  3.84977 -2.187835 -2.276958
H  -0.338535 4.838455 0.980789
H  5.699955 -2.114483 -0.581741
H  -0.580814 5.08651 -1.505793
H  -2.091868 -0.409696 2.015941
H  -2.012871 -2.038868 -2.010191
H  -4.59959 -0.514305 2.008695
H  -4.531157 -2.176001 -2.009112
H  -5.829554 -1.402124 0.003273
