program: Gaussian 09
title: 000182796
version: EM64L-G09RevD.01
frameworkgroup: C1[X(C19H22N4O)]
method: RPBEPBE
basis: SDD
operation: Freq
keyword: #p
keyword: freq=noraman
keyword: PBEPBE/SDD
title: #p freq=noraman PBEPBE/SDD
converged: YES YES NO NO
title: Mulliken charges:
elementType: O N N N N C C C C C C C C C C C C C C C C C C C H H H H H H H H H H H H H H H H H H H H H H
charge: -0.435452 -0.092723 -0.056094 -0.427379 -0.037117 -0.363234 -0.374234 -0.383509 -0.382370 -0.335772 0.351018 -0.331553 0.335430 -0.083294 -0.339761 -0.593679 0.389489 0.413384 -0.557740 -0.371068 -0.432728 -0.409411 -0.245982 -0.242612 0.209192 0.200536 0.197338 0.213179 0.194086 0.235524 0.233727 0.195740 0.208138 0.192693 0.277259 0.203611 0.216587 0.201483 0.257330 0.267890 0.230219 0.333967 0.236807 0.245481 0.227386 0.228217
chargesum: 0.00000
title: Mulliken charges with hydrogens summed into heavy atoms:
elementType: O N N N N C C C C C C C C C C C C C C C C C C C
charge: -0.101485 -0.092723 -0.056094 -0.150121 -0.037117 0.046495 0.036283 0.046101 0.047097 0.065059 0.351018 0.088645 0.335430 -0.083294 -0.082431 -0.392196 0.389489 0.413384 -0.289850 -0.140849 -0.195921 -0.163929 -0.018597 -0.014395
polarizability: 3.93567727e+02 -4.16453610e+01 2.64550417e+02 -7.32552359e-01 -2.60302669e+00 1.34464532e+02
1716.lowfreq: 0.0003 0.0006 0.0008 1.1013 6.5807 13.4258 18.1533 21.9671 39.3946
frequency: 17.5355 21.9026 38.9485 61.8162 66.7137 76.0793 101.7582 103.3342 125.2815 177.5113 187.9437 235.4872 248.8003 249.4054 274.2825 279.7259 303.2300 323.0501 332.5774 352.5886 371.5587 386.6396 408.4484 413.5719 424.8198 426.5581 474.7111 499.5305 509.1773 520.3119 541.4809 580.3005 596.2318 621.5735 623.6794 626.6521 663.6846 736.4934 753.8735 769.0325 769.2842 782.3246 796.4455 802.8982 812.4793 843.4939 846.5971 850.9573 855.0771 884.4445 908.0035 926.3428 929.8541 957.3821 967.1261 968.0234 989.5877 993.7642 1006.5899 1014.8415 1039.9254 1044.9376 1055.1029 1060.4259 1061.6632 1092.4293 1118.8954 1129.0941 1140.1680 1141.7875 1152.7419 1163.0098 1171.3617 1189.7816 1225.9184 1232.6595 1244.0471 1265.7593 1268.8423 1280.2824 1283.9909 1299.0200 1300.1703 1304.8427 1323.9616 1333.8691 1342.8475 1344.8553 1362.0868 1364.7293 1370.1692 1379.3414 1395.1738 1397.4305 1413.1256 1434.6763 1444.5199 1455.0249 1455.4834 1461.0301 1466.5638 1471.9093 1473.8791 1482.8154 1505.2474 1548.0710 1559.4909 1578.1787 1610.2179 1638.6891 2867.9429 2872.7598 2890.9939 2893.9400 2900.2779 2983.2973 3008.1034 3038.3691 3053.4274 3063.6120 3068.3375 3087.1423 3096.9420 3113.9270 3115.9732 3125.8726 3142.5818 3150.2112 3161.7139 3183.3502 3435.7858 3561.5734
redmass: 5.2006 5.9383 2.9662 3.3103 3.7915 2.9895 4.0063 4.1357 5.2153 4.8736 4.2387 3.5546 1.9385 4.2740 3.0993 3.6100 1.4182 3.1354 2.1559 2.3737 2.3826 6.0495 2.3235 3.7541 4.2076 2.0068 2.2750 3.1414 3.5120 5.7744 6.1559 3.8128 6.7461 6.5663 3.3649 2.3811 5.8541 5.8577 1.3064 3.7799 3.8230 2.1236 2.5352 2.2768 1.8538 1.4976 1.5288 5.4705 1.3545 1.6993 5.4766 1.7681 2.1989 1.4053 1.4087 3.7998 1.3452 3.3034 2.8292 2.2965 2.1495 1.8283 2.1800 1.5988 2.6948 2.1768 1.9634 2.4058 2.4802 2.3679 2.0280 1.5213 1.0818 1.0898 2.2604 1.5678 2.2215 1.3502 1.3658 1.4137 1.5003 1.3553 1.2488 2.2448 2.9668 1.2703 2.4266 1.3284 1.5221 1.5923 1.6045 1.3199 3.6284 1.4451 2.3207 4.2494 3.3385 1.0825 1.0838 1.3369 1.1326 1.2395 1.5349 1.0899 2.8251 3.7493 5.0014 6.3508 6.0717 6.8281 1.0713 1.0699 1.0702 1.0686 1.0678 1.0671 1.0904 1.0900 1.0899 1.0905 1.0915 1.0984 1.0900 1.0902 1.0868 1.0876 1.0950 1.0918 1.1003 1.0929 1.0751 1.0663
irintensity: 0.4001 0.7116 0.7987 2.1932 3.3047 1.9868 1.5752 1.1739 1.9396 0.4530 0.8315 2.4572 5.1675 0.3153 1.9209 3.0692 80.0748 26.8271 70.1750 9.9443 15.1051 0.6577 2.8259 4.8699 3.6895 32.3537 45.5032 11.7004 0.0647 5.7993 0.6308 1.1995 4.3618 1.8878 1.6182 3.1352 1.4601 6.2854 46.8736 4.1292 1.1590 7.3368 6.1290 4.8474 5.6657 1.1582 17.3879 37.8733 15.9054 56.4297 1.4653 14.4519 11.7070 0.0965 10.5531 107.3826 0.3073 22.7022 72.3361 5.4861 0.5278 2.9810 0.6079 4.3152 0.6013 27.3946 47.4507 11.5721 9.0716 12.7464 12.1495 1.5974 0.1472 0.9326 4.2459 2.4298 2.7070 14.2950 10.1715 5.1353 4.7152 22.4840 11.5915 9.1466 8.5051 5.1014 39.6669 24.8293 61.2057 8.7594 36.3435 3.0654 41.0364 1.1163 33.5878 23.8505 1.7265 1.2531 1.9510 14.8128 2.9409 4.1167 14.2775 11.0445 12.7407 194.2360 124.7648 141.9253 35.0872 3.5051 61.1417 29.1860 14.2837 40.0728 208.3200 60.8266 22.8590 42.3202 36.7465 27.9723 14.8394 41.7524 20.7007 37.0873 6.0243 0.0790 30.2677 4.7099 45.9147 8.5896 62.8957 8.4803
temp: 298.150 k
press: 1.00000 atm
elementType: 8 7 7 7 7 6 6 6 6 6 6 6 6 6 6 6 6 6 6 6 6 6 6 6 1 1 1 1 1 1 1 1 1 1 1 1 1 1 1 1 1 1 1 1 1 1
symmnumber: 1
zpe: 993667.3 jmol-1
zpe.correction: 0.378468 hartree
zpe.thermalcorrener: 0.399486 hartree
zpe.thermalcorrenthalpy: 0.400430 hartree
zpe.thermalcorrgfe: 0.326853 hartree
zpe.sumelectzpe: -1029.659286 hartree
zpe.sumelectthermal: -1029.638268 hartree
zpe.sumelectthermalent: -1029.637324 hartree
zpe.sumelectthermalfe: -1029.710901 hartree
dipole: -2.9747 -3.6044 1.9631
dipole: 5.0689
quadrupole: -145.7772 -143.1351 -143.3267
quadrupole: -12.6817 -15.0511 -1.0453
quadrupole: -1.6976 0.9446 0.7530 -12.6817 -15.0511 -1.0453
hfenergy: -1030.0377539 hartree
pointgroup: C01 [X(C19H22N4O1)]
dipole: 1.182825 -1.3874163 -0.8081751 debye
polarizability: 393.9874198|40.1401984|263.1969915|9.3504177|10.4336333|135.398265 unknown
InChI: InChI=1S/C19H22N4O/c24-12-11-22-7-9-23(10-8-22)21-18-5-6-20-19-14-16-4-2-1-3-15(16)13-17(18)19/h1-6,13-14,21,24H,7-12H2
charge 0 multiplicity 1
46 atoms
O  8.489785 -1.132479 0.59757
N  4.8223 -0.458574 -0.159984
N  2.003595 0.137503 0.01385
N  0.616331 -0.167188 0.013163
N  -2.360769 2.919528 0.181848
C  4.189197 -0.114483 1.138316
C  4.117983 0.233198 -1.26782
C  2.709468 -0.532154 1.142264
C  2.637673 -0.183317 -1.297807
C  6.289073 -0.239108 -0.164529
C  -0.347348 0.834201 0.067647
C  7.043551 -1.392605 0.531336
C  -1.763352 0.478608 0.002652
C  -2.729124 1.575711 0.061984
C  -0.00644 2.191104 0.187969
C  -2.239147 -0.847635 -0.115363
C  -3.625486 -1.143162 -0.182834
C  -4.587377 -0.049094 -0.126949
C  -4.110503 1.278403 -0.004587
C  -1.040673 3.173948 0.240927
C  -4.114713 -2.492108 -0.305872
C  -5.993606 -0.357595 -0.197672
C  -5.480621 -2.75301 -0.371787
C  -6.430332 -1.673558 -0.317201
H  4.710822 -0.643027 1.955331
H  4.255894 0.983419 1.343592
H  4.174802 1.346121 -1.1678
H  4.590376 -0.04897 -2.226456
H  2.645813 -1.644258 1.055386
H  2.225035 -0.221392 2.083415
H  2.098935 0.371942 -2.084729
H  2.57256 -1.276389 -1.518881
H  6.581671 0.724287 0.319421
H  6.623551 -0.184033 -1.219955
H  0.339161 -1.145724 -0.128606
H  6.817722 -2.347759 0.01465
H  6.740248 -1.487976 1.586786
H  -1.546928 -1.69917 -0.155418
H  1.045027 2.48058 0.240358
H  -4.806118 2.123018 0.042113
H  -0.760967 4.231104 0.336376
H  8.859407 -1.11929 -0.3213
H  -3.391362 -3.315898 -0.34778
H  -6.714816 0.466992 -0.15562
H  -5.84181 -3.78303 -0.465877
H  -7.501585 -1.896782 -0.370626
