program: Gaussian 09
title: 000182823
version: EM64L-G09RevD.01
frameworkgroup: C1[X(C26H28N4O)]
method: RPBEPBE
basis: SDD
operation: Freq
keyword: #p
keyword: freq=noraman
keyword: PBEPBE/SDD
title: #p freq=noraman PBEPBE/SDD
converged: YES YES NO NO
title: Mulliken charges:
elementType: O N N N N C C C C C C C C C C C C C C C C C C C C C C C C C C H H H H H H H H H H H H H H H H H H H H H H H H H H H H
charge: -0.288643 -0.106316 -0.377376 -0.506282 -0.024361 -0.343060 -0.338212 -0.326094 -0.403116 0.284005 0.328991 0.392118 -0.062873 0.411114 -0.671436 -0.673222 -0.609094 -0.548165 0.489584 0.156567 0.282868 -0.331092 -0.433429 -0.406143 -0.395039 -0.470766 -0.366364 -0.330610 -0.387212 -0.242571 -0.240544 0.234059 0.192635 0.234673 0.189837 0.206687 0.187943 0.233590 0.248373 0.293958 0.204022 0.225620 0.208711 0.203519 0.228372 0.206947 0.214348 0.270733 0.309607 0.261956 0.239932 0.247441 0.275414 0.230853 0.276894 0.211506 0.238218 0.230025 0.230899
chargesum: 0.00000
title: Mulliken charges with hydrogens summed into heavy atoms:
elementType: O N N N N C C C C C C C C C C C C C C C C C C C C C C C C C C
charge: -0.288643 -0.106316 -0.083418 -0.196675 -0.024361 0.083634 0.086297 0.068536 0.078847 0.284005 0.328991 0.392118 -0.062873 0.411114 -0.033083 -0.034383 -0.394746 -0.277432 0.489584 0.156567 0.282868 -0.069136 -0.193497 -0.158703 -0.119624 -0.239913 -0.089470 -0.119104 -0.148994 -0.012545 -0.009645
polarizability: 6.22681200e+02 -4.10628352e+01 3.44531975e+02 2.98719153e+01 2.02371935e+01 1.79943676e+02
1716.lowfreq: -12.7452 -4.9286 -2.9206 -0.0020 0.0012 0.0017 6.0664 10.6402 11.3996
frequency: -7.6018 10.1647 11.1536 29.7967 34.6968 43.9531 55.2428 65.7944 76.5676 82.7883 89.0137 96.0286 101.9917 124.9224 160.0403 179.2334 199.1361 208.1643 229.6828 251.8241 258.3467 259.8385 281.2693 292.3265 298.2233 314.0779 322.6364 350.2253 390.2437 395.4937 400.0406 408.7224 410.9038 438.0466 452.2322 468.5259 472.1508 489.4362 504.8323 521.1830 530.4274 538.8333 544.8631 582.5622 589.9879 618.7747 621.2361 633.1698 643.9596 669.4903 685.0100 734.5179 742.5904 751.2505 755.6247 759.2567 770.0660 783.8539 795.0250 797.8827 800.6069 810.4156 823.7766 834.3177 837.6202 853.3819 868.1751 876.5744 891.6018 909.1122 916.8124 927.6384 940.6534 953.3269 969.2838 988.6867 991.9217 992.6509 997.3619 1010.4680 1015.0101 1031.5449 1042.1650 1065.3335 1066.7842 1072.9230 1077.3293 1084.2663 1121.9496 1127.6301 1140.3036 1144.1144 1166.8891 1172.7708 1174.5965 1196.7398 1207.0105 1221.2455 1242.7539 1247.0698 1256.3573 1273.7490 1281.1956 1282.6305 1292.2286 1299.4801 1303.3328 1312.7649 1317.8428 1331.6413 1348.1689 1362.4318 1362.8360 1372.4059 1378.8217 1379.9991 1385.6493 1387.1659 1399.2784 1411.5238 1423.7974 1437.3854 1441.3825 1446.0490 1461.7505 1463.1000 1471.8475 1472.1185 1478.1401 1479.9171 1483.6592 1488.8711 1492.5949 1497.8598 1519.8595 1533.9686 1556.7910 1565.8419 1580.2691 1600.3186 1609.6052 1622.2082 1638.5266 2853.0853 2867.0350 2907.9554 2980.3597 2982.1617 3023.1668 3028.5622 3032.5353 3033.2714 3071.8947 3074.8505 3090.0133 3090.5715 3094.2525 3104.2582 3113.6567 3120.0353 3120.2024 3129.0631 3137.1209 3145.1956 3153.1788 3153.9408 3163.6722 3172.8386 3182.3305 3533.1069 3567.1397
redmass: 4.1934 5.4710 3.5663 5.1191 4.9477 4.9494 4.0119 3.3651 2.7789 2.7958 3.0858 5.1934 4.4379 3.7535 4.0524 1.5978 3.1150 1.5521 3.4749 3.9759 2.2322 2.9610 3.2122 2.5237 3.9952 3.5967 3.5257 4.7764 5.7984 3.3221 3.2167 3.0540 3.3132 3.5756 3.9394 3.0457 2.5031 2.3806 3.5551 1.3583 1.8898 3.0312 4.0236 3.7004 5.4769 6.5975 4.5840 6.5532 5.6357 5.3032 4.5165 1.9012 4.0495 2.8918 1.5487 2.4131 3.7890 2.2933 1.1395 1.4569 2.1938 2.9003 1.7314 1.7144 2.2831 1.5686 4.6916 1.4284 1.6837 5.1853 1.9600 1.7693 1.4053 1.4248 1.4061 2.3095 1.3478 4.1263 1.3511 3.0855 2.3451 3.3380 3.2504 1.9340 2.2628 2.7890 1.9115 2.1118 1.6360 1.4861 1.7547 2.2770 1.5077 1.0864 1.8895 1.1642 2.2545 1.6752 2.1561 1.5711 1.8822 1.9826 1.1929 1.7071 1.2079 2.1491 1.1723 2.0555 2.0494 1.3448 2.4116 2.7433 1.4830 1.3006 2.4181 1.3292 1.2460 1.2495 3.8398 2.4467 3.9219 5.5495 1.2117 2.8515 1.0562 1.0569 1.6426 1.4365 1.6308 1.0757 1.0797 1.0805 1.1213 2.3921 3.1881 4.8266 6.2705 5.5436 4.8155 5.7720 5.4834 6.4031 6.8116 1.0720 1.0715 1.0690 1.0357 1.0356 1.0619 1.0863 1.0884 1.0904 1.0983 1.0982 1.1003 1.1002 1.1045 1.0900 1.0867 1.0885 1.0883 1.0878 1.0965 1.0953 1.0885 1.0920 1.1004 1.0960 1.0935 1.0748 1.0773
irintensity: 0.3087 0.1499 0.4566 1.5042 0.5058 3.2438 3.4186 0.2229 0.4470 1.8733 0.6688 1.4113 0.7766 2.9030 2.1566 2.0131 1.6522 0.9550 1.0840 3.4609 1.5983 0.7811 0.6544 2.2947 21.4330 22.2097 1.0605 1.8851 1.3414 1.9047 7.0328 8.3761 6.2485 5.4019 1.9701 9.4245 11.2901 21.4809 5.7060 212.3503 42.5548 2.9414 25.9631 3.6097 12.8444 3.3403 1.7096 5.1179 0.5388 3.5289 33.2214 4.2831 12.0946 10.2491 53.9911 8.7543 0.5061 2.4474 7.0211 6.0715 6.8190 4.8901 19.1632 34.1082 20.6010 6.9963 20.3440 14.0459 50.1688 1.9913 0.1098 11.1643 0.1929 5.3786 10.9668 3.3586 0.2640 3.4984 3.1381 1.6435 4.1616 2.5654 6.4368 22.8866 10.6601 33.9622 31.9744 2.7386 0.7473 25.8154 7.4435 6.2636 10.5496 0.8548 30.1906 98.1473 49.9587 3.6277 4.1486 27.2423 26.9986 332.0562 0.5215 1.5667 13.3222 25.9895 22.3218 3.0479 39.8817 34.5367 127.2148 94.6443 3.7536 7.0374 39.6483 4.5511 26.9561 22.0256 67.2982 52.7179 1.3419 9.6773 45.6246 10.8597 15.7498 2.4851 106.0360 10.6075 509.4151 40.4189 42.3880 10.2898 8.5936 197.1829 33.9930 512.0298 27.0742 221.2213 57.7996 84.8440 23.2829 234.0442 3.7247 63.7259 126.9498 74.5602 33.6262 36.6148 42.9888 7.8083 23.3736 25.5814 55.9803 75.2554 34.1947 51.3998 12.9612 13.8421 26.6805 9.0123 23.9055 0.0244 17.8439 28.3917 2.4926 3.5067 47.4048 12.6302 5.8123 19.0422 13.4221
temp: 298.150 k
press: 1.00000 atm
elementType: 8 7 7 7 7 6 6 6 6 6 6 6 6 6 6 6 6 6 6 6 6 6 6 6 6 6 6 6 6 6 6 1 1 1 1 1 1 1 1 1 1 1 1 1 1 1 1 1 1 1 1 1 1 1 1 1 1 1 1
symmnumber: 1
zpe: 1271456.7 jmol-1
zpe.correction: 0.484272 hartree
zpe.thermalcorrener: 0.511984 hartree
zpe.thermalcorrenthalpy: 0.512929 hartree
zpe.thermalcorrgfe: 0.422607 hartree
zpe.sumelectzpe: -1299.600441 hartree
zpe.sumelectthermal: -1299.572729 hartree
zpe.sumelectthermalent: -1299.571785 hartree
zpe.sumelectthermalfe: -1299.662107 hartree
dipole: 0.3031 6.0238 1.4386
dipole: 6.2007
quadrupole: -179.9863 -179.7347 -185.4199
quadrupole: -4.6470 -0.9266 4.4304
quadrupole: 1.7273 1.9789 -3.7062 -4.6470 -0.9266 4.4304
hfenergy: -1300.0847136 hartree
pointgroup: C01 [X(C26H28N4O1)]
dipole: 0.0751089 2.3108114 0.7783385 debye
polarizability: 624.9326783|-36.8959352|337.7028966|21.0038564|35.7267746|184.5212765 unknown
InChI: InChI=1S/C26H28N4O/c1-3-30(4-2)16-15-28-26(31)19-9-11-22(12-10-19)29-24-13-14-27-25-18-21-8-6-5-7-20(21)17-23(24)25/h5-14,17-18,28-29H,3-4,15-16H2,1-2H3
charge 0 multiplicity 1
59 atoms
O  4.502129 -1.446732 -0.399134
N  8.273609 0.845924 -0.429889
N  4.75388 0.425305 0.951643
N  -1.779615 -0.127723 0.626334
N  -4.924586 -2.870954 -0.419904
C  6.823712 1.127812 -0.306583
C  8.541263 -0.406301 -1.193416
C  9.074868 2.004818 -0.902561
C  6.224008 0.362081 0.90218
C  -4.137726 -0.528245 0.051432
C  -2.777874 -1.031254 0.226943
C  -5.830356 1.277328 0.002007
C  -5.182089 -1.506841 -0.246906
C  -6.875792 0.294369 -0.257092
C  9.862505 -1.086418 -0.787331
C  9.26355 3.084192 0.180487
C  -4.487879 0.838717 0.145513
C  -6.519485 -1.07023 -0.383454
C  -0.374023 -0.259655 0.543776
C  3.97407 -0.510201 0.286986
C  2.481488 -0.37335 0.414028
C  -2.551308 -2.402512 0.039105
C  -6.193742 2.6676 0.097469
C  -8.236939 0.747015 -0.394462
C  0.27405 -1.045867 -0.450538
C  0.426718 0.470104 1.46712
C  1.676457 -1.100483 -0.500467
C  1.830402 0.415339 1.399206
C  -3.647285 -3.262806 -0.286657
C  -7.519357 3.069072 -0.041999
C  -8.552205 2.098208 -0.288511
H  6.258593 0.840379 -1.223928
H  6.673843 2.213834 -0.160572
H  7.705216 -1.104294 -1.00299
H  8.537782 -0.211697 -2.295529
H  10.070735 1.624606 -1.194537
H  8.631174 2.464544 -1.822526
H  6.644437 0.76456 1.840636
H  6.503339 -0.702215 0.828545
H  4.312007 1.231122 1.393485
H  10.737625 -0.438245 -0.977639
H  9.848545 -1.330151 0.289289
H  10.006993 -2.020928 -1.361135
H  8.297867 3.511134 0.508544
H  9.761835 2.650029 1.064672
H  9.88228 3.916299 -0.204825
H  -3.718636 1.607912 0.293522
H  -7.276028 -1.831646 -0.600027
H  -2.109903 0.703404 1.120323
H  -1.563412 -2.841326 0.192893
H  -5.407455 3.408896 0.285108
H  -9.020637 0.005073 -0.586401
H  -0.315957 -1.581532 -1.198656
H  -0.058146 1.060757 2.254286
H  2.186095 -1.70775 -1.255603
H  2.40514 0.959804 2.157992
H  -3.455093 -4.334667 -0.419986
H  -7.78567 4.128877 0.034934
H  -9.589815 2.433009 -0.394405
