program: Gaussian 09
title: 000182801
version: EM64L-G09RevD.01
frameworkgroup: C1[X(C28H22N4)]
method: RPBEPBE
basis: SDD
operation: Freq
keyword: #pfreq=noraman
keyword: PBEPBE/SDD
title: #p freq=noraman PBEPBE/SDD
converged: YES YES NO NO
title: Mulliken charges:
elementType: N N N N C C C C C C C C C C C C C C C C C C C C C C C C C C C C H H H H H H H H H H H H H H H H H H H H H H
charge: -0.407549 -0.393600 -0.030279 -0.028405 0.325523 0.335470 -0.418376 -0.403321 0.333584 0.358747 -0.082939 -0.084420 0.388862 0.386675 -0.592452 -0.588300 0.414742 0.414361 -0.558028 -0.556306 -0.307757 -0.340041 -0.433856 -0.430190 -0.409373 -0.409046 -0.402953 -0.394636 -0.245477 -0.244372 -0.241674 -0.240310 0.223264 0.253665 0.225061 0.222539 0.300880 0.314822 0.193985 0.199126 0.270166 0.268801 0.239041 0.216857 0.236681 0.239941 0.246911 0.245930 0.240321 0.231517 0.228487 0.229042 0.229552 0.229105
chargesum: 0.00000
title: Mulliken charges with hydrogens summed into heavy atoms:
elementType: N N N N C C C C C C C C C C C C C C C C C C C C C C C C C C C C
charge: -0.106669 -0.078779 -0.030279 -0.028405 0.325523 0.335470 0.058553 0.044279 0.333584 0.358747 -0.082939 -0.084420 0.388862 0.386675 -0.398467 -0.389174 0.414742 0.414361 -0.287862 -0.287506 -0.068716 -0.123183 -0.197175 -0.190249 -0.162462 -0.163116 -0.162632 -0.163118 -0.016990 -0.015330 -0.012121 -0.011205
polarizability: 4.73078259e+02 1.24596180e+01 4.23058050e+02 -9.18024463e+01 6.96345753e+00 2.23849895e+02
1716.lowfreq: -4.7860 -3.3278 -0.0009 0.0003 0.0007 6.0793 9.5098 12.0784 20.1205
frequency: 8.4786 10.4138 20.0480 41.6670 50.2675 63.9484 78.9493 97.1638 99.6777 144.4963 159.7565 179.9375 186.9027 229.0930 249.4278 252.5337 275.6858 288.7791 291.7066 303.3311 315.5676 370.7576 381.5574 385.6007 386.1231 404.2660 418.0477 430.0522 449.4635 468.3036 476.3804 480.2052 505.5259 507.3557 519.3627 539.1527 541.9317 577.9981 580.7130 583.0619 586.5508 618.8751 619.1548 624.1589 630.6386 655.3392 656.8342 723.5853 724.7973 753.4471 755.1697 768.0370 768.8503 780.7597 781.9113 783.5791 786.2908 811.1439 824.5065 826.3140 834.6851 845.8709 849.3995 869.9835 883.3677 886.4529 907.3460 908.3380 912.3558 924.8265 926.0062 942.7719 949.3691 967.6029 969.5140 990.2031 991.5364 1002.0414 1009.0660 1015.3201 1016.3649 1047.9716 1069.4964 1079.7242 1119.8436 1122.7479 1150.0498 1152.7288 1168.4435 1169.1430 1171.5975 1172.3155 1227.3654 1235.3535 1235.7919 1248.0688 1252.3616 1269.7248 1284.7614 1285.4607 1309.3854 1310.2720 1324.8282 1328.2167 1345.5934 1350.6735 1360.2513 1362.8331 1371.5065 1375.0685 1396.0963 1397.3977 1415.4732 1417.7165 1436.4003 1437.0265 1445.1617 1445.4189 1466.2620 1469.4271 1470.5857 1471.8039 1506.2082 1507.5646 1545.7219 1551.3067 1559.1360 1563.3425 1578.2050 1582.3582 1610.0168 1610.1830 1639.0471 1639.8212 2987.2486 2997.5633 3050.7611 3067.3684 3094.9223 3108.9127 3110.3911 3116.4396 3119.9005 3120.6770 3127.7247 3128.0317 3143.7849 3144.4721 3152.6859 3152.9746 3162.6428 3162.8216 3163.0425 3173.4192 3580.4365 3587.1876
redmass: 5.8577 6.3670 6.1508 4.9259 4.9165 4.8079 4.4429 4.7444 4.9518 4.6942 4.1869 4.1436 4.3236 4.2488 4.2376 3.8001 4.0780 4.3667 4.2162 4.1178 3.9471 2.0808 2.1270 5.6105 5.5189 3.0617 1.9610 1.6400 4.6827 4.7730 2.2670 2.2127 3.4583 3.4647 2.4383 5.9959 5.4869 5.3814 3.7283 3.6545 4.6815 6.5641 6.4207 4.1798 4.1776 5.5969 5.4663 5.1963 5.3457 1.3097 1.3106 3.8056 3.6876 2.0456 2.0791 3.7461 4.2174 1.4787 2.3982 1.9203 4.3554 1.5972 1.5623 3.6015 1.7118 1.6955 4.5546 5.5184 2.5651 1.6853 1.7155 1.4749 1.4335 1.4053 1.4032 1.3477 1.3458 3.9037 3.7065 2.2812 2.3170 2.3646 2.3200 2.3151 2.2944 2.4567 1.6803 1.7476 1.4799 1.4885 1.0912 1.0874 1.2482 1.6628 1.6006 2.0214 2.1337 1.3313 1.6700 1.6604 2.3723 2.5323 2.6157 2.7074 1.3078 1.9293 2.0310 1.4968 2.1058 1.9330 4.0629 4.1264 2.2512 2.2001 5.0862 5.0944 3.2443 3.1837 1.2081 1.3251 2.4557 1.6334 2.8671 3.0020 3.6459 4.2073 5.4883 4.2131 5.4194 5.9549 5.7333 5.6740 6.8158 6.7869 1.0617 1.0620 1.1026 1.1012 1.0889 1.0891 1.0895 1.0870 1.0901 1.0860 1.0874 1.0880 1.0951 1.0954 1.0918 1.0918 1.0971 1.1001 1.0964 1.0933 1.0758 1.0762
irintensity: 1.4056 0.6034 0.0891 0.2288 0.2829 0.2193 2.9923 0.3769 1.1249 1.2384 1.1427 0.1796 1.9683 1.4999 0.3852 0.5180 1.2399 0.2483 1.7617 0.6911 0.9576 5.3326 41.1437 1.3429 5.5515 1.5815 32.8231 59.5022 17.6510 3.2735 56.8751 89.7341 0.7187 0.5980 18.3329 0.4248 0.1662 3.4206 0.3511 0.1761 4.4270 3.0499 2.5195 0.2803 0.0259 1.2497 1.1184 14.3618 13.2345 43.8852 44.9544 0.4200 1.1149 3.9583 9.4698 4.0728 4.1201 44.8740 33.0997 33.6745 19.0435 14.7929 11.6466 4.7461 53.1053 49.7815 0.9917 0.7278 6.1207 6.3973 12.7155 4.4917 1.9919 11.1764 11.0129 0.3372 0.2008 6.2077 3.1069 4.3530 3.5386 4.9404 2.3598 1.6592 10.1604 4.2216 14.5153 13.3842 2.4187 1.9716 0.0166 0.0846 17.6385 6.8617 3.8501 4.7469 21.1117 31.7750 1.6402 1.2533 4.4092 2.2239 12.3333 18.4806 41.8889 166.5359 16.6994 15.2971 34.9468 20.0590 51.9550 26.4464 35.4748 21.7196 6.9297 5.1801 0.2988 0.9108 26.4206 15.7195 10.2441 13.2579 35.2087 18.2064 334.8332 133.6467 76.0292 153.0712 62.3937 160.6180 36.8866 25.1481 4.7808 5.5105 14.3226 107.8431 15.3814 30.3157 19.5613 19.6034 35.9499 5.4704 23.1711 3.8484 0.1172 0.3342 28.9693 30.2329 2.8938 3.8843 74.0280 43.8931 2.4135 13.3128 16.8974 18.8353
temp: 298.150 k
press: 1.00000 atm
elementType: 7 7 7 7 6 6 6 6 6 6 6 6 6 6 6 6 6 6 6 6 6 6 6 6 6 6 6 6 6 6 6 6 1 1 1 1 1 1 1 1 1 1 1 1 1 1 1 1 1 1 1 1 1 1
symmnumber: 1
zpe: 1124206.9 jmol-1
zpe.correction: 0.428188 hartree
zpe.thermalcorrener: 0.453055 hartree
zpe.thermalcorrenthalpy: 0.453999 hartree
zpe.thermalcorrgfe: 0.370476 hartree
zpe.sumelectzpe: -1297.048754 hartree
zpe.sumelectthermal: -1297.023887 hartree
zpe.sumelectthermalent: -1297.022942 hartree
zpe.sumelectthermalfe: -1297.106466 hartree
dipole: 3.7531 -3.2361 -4.9525
dipole: 7.0061
quadrupole: -191.5700 -158.7811 -190.2790
quadrupole: -13.5809 -9.1396 5.3517
quadrupole: -11.3600 21.4289 -10.0689 -13.5809 -9.1396 5.3517
hfenergy: -1297.4769416 hartree
pointgroup: C01 [X(C28H22N4)]
dipole: 1.0406535 0.1519456 2.5478976 debye
polarizability: 423.2162333|-72.0900734|391.9185571|115.4323102|61.0862365|304.8514135 unknown
InChI: InChI=1S/C28H22N4/c1-3-7-21-17-27-23(15-19(21)5-1)25(9-11-29-27)31-13-14-32-26-10-12-30-28-18-22-8-4-2-6-20(22)16-24(26)28/h1-12,15-18,31-32H,13-14H2
charge 0 multiplicity 1
54 atoms
N  1.440118 1.962631 1.554454
N  -1.659078 1.449796 1.672808
N  2.079242 -0.22058 -2.097299
N  -4.570112 2.726437 -1.221276
C  2.793492 0.371363 0.245193
C  -3.274041 0.877063 -0.103847
C  0.386672 2.949687 1.811055
C  -0.872265 2.354736 2.510703
C  1.632005 1.256901 0.370394
C  -2.585665 1.867486 0.727175
C  2.960355 -0.346315 -1.018223
C  -4.260317 1.370052 -1.064202
C  4.855872 -0.69697 1.110271
C  -3.722813 -1.44146 -0.849052
C  3.747757 0.175824 1.270203
C  -3.035845 -0.513355 -0.023328
C  5.016859 -1.414063 -0.148304
C  -4.705894 -0.94827 -1.805179
C  4.064014 -1.216076 -1.17634
C  -4.945908 0.445046 -1.884419
C  0.761667 1.350294 -0.730615
C  -2.911785 3.223393 0.530457
C  5.828293 -0.898754 2.153332
C  -3.477905 -2.858198 -0.772578
C  6.1425 -2.300419 -0.30357
C  -5.39954 -1.896624 -2.639454
C  1.035552 0.606762 -1.919637
C  -3.900999 3.585451 -0.435825
C  6.903871 -1.76316 1.96858
C  -4.16646 -3.74599 -1.594524
C  7.062402 -2.471896 0.726503
C  -5.138076 -3.259783 -2.537501
H  0.800689 3.741585 2.465602
H  0.094392 3.436719 0.864132
H  -0.546819 1.797914 3.408672
H  -1.515363 3.183914 2.863688
H  2.131453 1.836733 2.291565
H  -1.389657 0.467851 1.6785
H  3.668158 0.696027 2.234686
H  -2.304105 -0.927779 0.682433
H  4.155345 -1.736435 -2.135568
H  -5.676978 0.850054 -2.591986
H  -0.136049 1.971957 -0.704684
H  -2.432699 4.020038 1.105664
H  5.709239 -0.358677 3.10086
H  -2.733917 -3.229429 -0.057396
H  6.260304 -2.838147 -1.251528
H  -6.137882 -1.522576 -3.358209
H  0.343902 0.698246 -2.766394
H  -4.146296 4.647433 -0.56622
H  7.63796 -1.9095 2.768516
H  -3.97076 -4.821891 -1.530522
H  7.914952 -3.147846 0.598723
H  -5.669738 -3.973004 -3.176889
