program: Gaussian 09
title: 000182785
version: EM64L-G09RevD.01
frameworkgroup: C1[X(C22H21N3)]
method: RPBEPBE
basis: SDD
operation: Freq
keyword: #pfreq=noraman
keyword: PBEPBE/SDD
title: #p freq=noraman PBEPBE/SDD
converged: YES YES NO NO
title: Mulliken charges:
elementType: N N N C C C C C C C C C C C C C C C C C C C C C C H H H H H H H H H H H H H H H H H H H H H
charge: -0.508448 -0.430706 -0.035203 0.295546 0.323435 -0.069716 0.388992 0.412924 -0.603613 -0.040581 -0.557462 0.464082 0.494690 -0.339363 -0.435584 -0.410370 -0.430847 -0.406141 -0.423874 -0.383203 -0.675153 -0.722112 -0.388669 -0.246624 -0.243014 0.209381 0.206025 0.267586 0.302370 0.284276 0.255278 0.237904 0.233169 0.267467 0.244948 0.216601 0.234000 0.210595 0.208335 0.244007 0.235371 0.224710 0.203967 0.230382 0.227024 0.227618
chargesum: 0.00000
title: Mulliken charges with hydrogens summed into heavy atoms:
elementType: N N N C C C C C C C C C C C C C C C C C C C C C C
charge: -0.206077 -0.146430 -0.035203 0.295546 0.323435 -0.069716 0.388992 0.412924 -0.397588 0.168799 -0.289876 0.464082 0.494690 -0.084085 -0.197681 -0.165421 -0.197678 -0.138674 -0.207273 -0.149203 -0.012215 -0.058063 -0.158287 -0.019600 -0.015396
polarizability: 5.55447329e+02 -1.64857759e+01 2.73323366e+02 -1.13121527e+01 -9.04637477e+00 1.38956089e+02
1716.lowfreq: -2.9656 -0.0011 -0.0008 0.0001 5.5052 9.0298 19.9612 28.6153 36.0240
frequency: 19.9509 28.6026 35.9937 62.9316 73.7699 80.3908 100.3253 119.9497 134.9086 175.8720 187.9220 213.0417 240.6459 250.6997 253.3942 282.9769 306.6663 324.4356 328.9352 364.1510 387.9608 393.4759 403.9075 409.7207 419.7155 447.0742 466.2788 469.8823 491.4476 507.6226 513.2028 544.2189 568.5323 581.2763 606.0462 620.0886 627.4847 637.0020 665.4690 707.1187 742.8130 754.3571 767.1450 782.8842 788.6221 799.5741 802.9052 817.0262 822.0693 836.1006 849.2625 850.6717 866.3834 888.0667 908.9657 921.1419 924.2582 927.7966 942.3161 943.1240 955.8461 966.7088 977.8476 988.9822 994.2532 1015.3439 1031.6814 1065.6904 1118.2364 1134.2607 1140.0189 1159.9569 1166.9738 1171.6914 1184.0420 1190.9664 1222.4047 1241.8968 1250.6715 1282.7208 1286.8075 1298.5141 1312.8715 1323.1150 1325.7030 1339.8981 1353.6717 1360.9241 1376.8539 1379.9865 1394.0005 1397.1593 1415.6514 1429.7296 1435.6750 1444.1048 1459.7397 1464.9059 1467.6814 1475.1669 1483.2850 1487.9805 1508.2702 1520.0885 1543.2784 1557.3896 1576.3324 1586.8637 1608.9368 1638.3466 1639.7186 2971.8400 2977.5926 2980.1781 3070.7334 3078.9759 3085.8403 3095.5728 3102.8544 3110.7938 3112.5455 3117.7860 3126.4056 3135.3635 3142.9358 3143.2175 3151.6665 3161.6556 3164.8013 3176.8575 3546.7619 3550.0144
redmass: 4.6226 3.9243 4.1718 4.1286 3.1818 3.9842 4.7242 4.7619 4.0215 4.8319 4.3946 1.0289 3.3259 3.6990 1.3527 4.1626 3.7457 4.0515 2.4934 1.3724 4.0680 3.3394 3.5970 2.9953 2.8978 3.5258 2.2157 2.8591 1.7715 3.3311 2.4044 5.7079 5.8654 3.7450 5.3639 5.6091 5.2913 6.6179 5.8687 3.7233 5.5434 1.3139 3.8941 2.2281 2.6773 3.3054 1.4990 2.4051 2.6809 1.4417 2.6170 1.6697 5.1682 1.6965 5.2995 1.2490 1.6962 1.3973 1.3953 1.3897 1.3596 1.4065 2.1162 1.3450 2.6819 2.3503 3.1522 2.2894 1.4553 2.2298 1.6137 1.8163 1.4895 1.0895 1.6622 1.3499 1.7071 2.1246 1.7889 1.6821 1.8344 2.1216 1.9077 1.9817 1.6762 1.4073 2.1846 3.0491 1.2172 2.9015 1.2277 4.2755 2.3126 3.7935 3.7642 3.2045 1.6913 1.1516 1.0517 1.5409 1.4009 1.1237 2.5879 3.4050 3.6381 5.9544 5.8950 4.2789 5.6772 6.8170 6.5827 1.0788 1.0395 1.0383 1.0983 1.0992 1.0999 1.0999 1.0894 1.0868 1.0899 1.0863 1.0877 1.0967 1.0952 1.0873 1.0917 1.1004 1.0960 1.0932 1.0748 1.0766
irintensity: 0.2032 0.1810 0.8952 0.8874 0.7031 0.6660 0.5916 0.1575 0.8745 0.8984 0.2560 0.5453 1.1827 1.0857 0.7092 0.3918 2.8944 0.3385 18.5771 56.4343 22.6030 29.5888 1.4052 4.4767 22.5025 5.0338 4.4681 2.6995 112.3527 11.7271 4.9284 4.9463 13.4030 6.3857 0.5529 1.6702 8.7416 0.4290 0.4900 3.7124 4.5643 52.5435 3.2975 1.4985 17.9778 7.6496 7.8630 39.5228 36.3005 10.3733 6.7135 9.4502 19.1932 53.9121 2.2314 6.0550 7.7167 1.5092 2.6048 3.5332 1.0277 11.2153 2.3452 0.2770 0.0485 6.4339 0.6281 2.4071 10.1336 17.4858 6.8214 8.5718 1.2271 0.2580 34.2051 100.1327 5.3429 12.5040 16.7398 65.2323 46.6856 16.2792 4.2183 6.8937 78.1727 7.9014 7.0289 239.7494 20.7018 13.1631 53.8031 56.5978 30.2017 13.4038 3.7874 3.5258 38.6890 1.6420 3.7709 40.7214 43.7914 19.2334 5.5398 963.8193 240.2405 66.1810 124.6030 23.4507 27.4183 4.6178 144.5957 23.7374 21.2616 42.7394 11.1735 66.5003 35.4951 42.0721 15.1919 26.4504 34.5030 3.8684 0.0756 20.2513 31.9380 27.6471 4.3906 52.0415 6.8516 15.3683 17.4534 51.5133
temp: 298.150 k
press: 1.00000 atm
elementType: 7 7 7 6 6 6 6 6 6 6 6 6 6 6 6 6 6 6 6 6 6 6 6 6 6 1 1 1 1 1 1 1 1 1 1 1 1 1 1 1 1 1 1 1 1 1
symmnumber: 1
zpe: 981810.0 jmol-1
zpe.correction: 0.373952 hartree
zpe.thermalcorrener: 0.395461 hartree
zpe.thermalcorrenthalpy: 0.396405 hartree
zpe.thermalcorrgfe: 0.322546 hartree
zpe.sumelectzpe: -1013.476389 hartree
zpe.sumelectthermal: -1013.454880 hartree
zpe.sumelectthermalent: -1013.453936 hartree
zpe.sumelectthermalfe: -1013.527795 hartree
dipole: -5.8116 -3.8093 0.2255
dipole: 6.9524
quadrupole: -109.0649 -145.9994 -150.7904
quadrupole: -8.4892 -1.3981 -5.7930
quadrupole: 26.2200 -10.7145 -15.5055 -8.4892 -1.3981 -5.7930
hfenergy: -1013.8503407 hartree
pointgroup: C01 [X(C22H21N3)]
dipole: -2.3029992 1.4617596 -0.2030853 debye
polarizability: 555.3502122|19.5510803|270.2550708|1.9993385|-23.2022677|142.1215004 unknown
InChI: InChI=1S/C22H21N3/c1-15(2)24-18-7-9-19(10-8-18)25-21-11-12-23-22-14-17-6-4-3-5-16(17)13-20(21)22/h3-15,24-25H,1-2H3
charge 0 multiplicity 1
46 atoms
N  -0.292673 0.428228 -0.384527
N  -5.968003 0.847593 -0.106093
N  2.356736 -2.917019 0.154966
C  1.988128 -0.434932 -0.054414
C  0.546052 -0.663177 -0.164996
C  2.848685 -1.609737 0.081845
C  3.98734 1.026136 0.017585
C  4.845459 -0.14773 0.119133
C  2.580878 0.848344 -0.062749
C  -6.865663 0.152386 0.834355
C  4.249574 -1.431833 0.156203
C  -1.719377 0.468318 -0.312941
C  -4.580835 0.698172 -0.162503
C  0.084397 -1.988599 -0.068438
C  4.594951 2.331504 0.008851
C  6.272216 0.040366 0.195192
C  -2.438342 1.253386 -1.253376
C  -2.449586 -0.191863 0.707426
C  -3.835503 1.376537 -1.174837
C  -3.852325 -0.094226 0.776168
C  -7.084629 -1.334615 0.448532
C  -8.2044 0.916212 0.901802
C  1.020155 -3.054894 0.088331
C  5.977806 2.476071 0.085258
C  6.825519 1.317476 0.177735
H  -6.398646 0.191507 1.839811
H  1.963954 1.756224 -0.096582
H  4.863649 -2.333536 0.252007
H  0.154319 1.284981 -0.712744
H  -6.411843 1.384296 -0.852239
H  -0.978368 -2.221895 -0.161349
H  3.949128 3.215452 -0.061878
H  -1.896579 1.765241 -2.058336
H  -1.91669 -0.770993 1.468032
H  6.915253 -0.844493 0.268942
H  -4.364649 1.996702 -1.909414
H  -4.375689 -0.623092 1.578146
H  -7.673039 -1.85822 1.224806
H  -7.632859 -1.40579 -0.509079
H  -6.121642 -1.861306 0.329509
H  -8.051221 1.958871 1.232314
H  -8.89463 0.423998 1.608514
H  -8.697653 0.930388 -0.089982
H  0.641464 -4.083651 0.143966
H  6.429664 3.474063 0.075043
H  7.91161 1.449247 0.23601
