program: Gaussian 09
title: 000182772
version: EM64L-G09RevD.01
frameworkgroup: C1[X(C13H17NO3)]
method: RPBEPBE
basis: SDD
operation: Freq
keyword: #p
keyword: freq=noraman
keyword: PBEPBE/SDD
title: #p freq=noraman PBEPBE/SDD
converged: YES YES NO NO
title: Mulliken charges:
elementType: O O O N C C C C C C C C C C C C C H H H H H H H H H H H H H H H H H
charge: -0.281281 -0.292650 -0.250604 -0.137219 -0.330499 -0.373612 0.124328 0.280839 -0.673464 -0.653708 -0.427351 -0.369601 0.240540 -0.213778 -0.353188 0.153721 -0.499438 0.255168 0.198718 0.250941 0.224098 0.203022 0.261338 0.218112 0.215111 0.229488 0.220700 0.279730 0.270774 0.236983 0.273778 0.242640 0.245462 0.230903
chargesum: 0.00000
title: Mulliken charges with hydrogens summed into heavy atoms:
elementType: O O O N C C C C C C C C C C C C C
charge: -0.281281 -0.292650 -0.250604 -0.137219 0.123388 0.101426 0.124328 0.280839 0.009008 0.011591 -0.147621 -0.098827 0.240540 0.023204 -0.079410 0.153721 0.219566
polarizability: 2.08391873e+02 -2.19759731e+00 1.78541370e+02 7.23185098e+00 4.69848760e+00 9.68609727e+01
1716.lowfreq: -8.7359 -1.2469 -0.0007 -0.0005 -0.0004 1.8519 28.3375 43.1417 51.0929
frequency: 28.2938 43.0803 51.0842 71.6746 82.1972 94.9798 111.8469 124.4481 133.1364 156.4613 197.0764 203.8903 207.7121 212.6044 291.3160 306.1766 307.6285 322.6647 349.9251 382.9985 418.2117 442.9794 457.6837 496.1713 556.4273 618.8536 651.9888 674.5096 709.2119 713.1664 741.5081 767.5889 780.7476 800.5040 834.3124 873.4407 930.2638 941.6730 949.6032 958.2129 990.6761 1005.5931 1008.1017 1061.4655 1068.7175 1075.3409 1082.6891 1101.6670 1110.8601 1114.9211 1148.0028 1177.7780 1183.5682 1206.5352 1239.5257 1285.6679 1297.6390 1302.1499 1345.0414 1356.3591 1382.0768 1388.3955 1395.0040 1406.6967 1417.3330 1428.0484 1451.6514 1452.8780 1464.0386 1466.2863 1469.7573 1472.6729 1475.7295 1483.9246 1488.9183 1548.2969 1591.3344 1604.4497 1627.6777 2976.7078 2985.9835 2989.4288 3004.6651 3015.9403 3069.9152 3070.3012 3086.7441 3087.2673 3096.3976 3106.4161 3106.9690 3141.7725 3147.8193 3159.0613 3171.3209 3183.8684
redmass: 3.8555 4.0446 4.6262 4.1459 2.7089 1.2960 3.0467 2.8389 4.3239 1.5728 1.2827 3.6206 3.7535 1.5698 3.4075 3.8171 3.8639 3.3494 3.7795 3.6848 3.0029 4.4986 4.5796 4.2911 4.1489 4.3593 6.3448 5.4231 5.1731 2.0979 7.0869 1.3894 1.2686 2.9141 1.6312 3.0066 3.1140 2.4240 1.6814 1.4059 6.0255 1.4052 2.6576 3.5915 2.2402 1.9112 1.8260 1.7574 1.6960 1.2638 1.4838 1.1636 1.9885 2.8034 2.2384 1.7597 1.3157 1.4491 1.2436 1.3115 1.2200 9.1292 1.2161 2.6294 1.9263 1.5025 1.0507 1.1529 1.0521 1.0586 1.5632 1.1021 1.4051 1.0641 1.0698 5.8574 6.5100 6.6255 9.5085 1.0686 1.0363 1.0362 1.0295 1.0618 1.0995 1.0945 1.0975 1.0994 1.1004 1.1045 1.1019 1.0870 1.1048 1.0923 1.0990 1.0914
irintensity: 0.6874 0.0812 1.7227 3.2853 0.7239 1.3614 1.0646 0.1216 4.6090 1.8519 0.1708 3.1993 2.9483 3.0561 10.2420 6.5415 0.9886 2.8244 1.4504 10.1868 2.1144 3.3675 4.3418 8.8852 2.8486 5.9222 5.6158 7.3623 9.5041 65.5130 2.6962 6.6206 12.7286 9.4610 25.1237 17.3953 3.8983 8.3571 13.9306 3.7499 1.7884 1.1600 7.2154 166.1703 25.0286 4.9813 30.9653 19.2819 14.8351 0.0184 52.9805 26.3991 24.0232 46.7423 160.5653 138.2539 4.4972 62.5984 4.8060 8.5021 28.2237 4.4708 23.6999 86.3643 62.8119 30.5986 17.2203 20.7999 10.4580 9.9979 1.1708 19.6785 4.9194 3.3133 24.0370 187.1188 32.6978 16.8554 209.3754 35.7423 35.6961 19.0071 38.4533 37.6235 18.1776 0.5409 60.6351 8.9639 43.6067 25.0159 29.2098 5.6684 14.2710 0.3037 13.7500 0.1612
temp: 298.150 k
press: 1.00000 atm
elementType: 8 8 8 7 6 6 6 6 6 6 6 6 6 6 6 6 6 1 1 1 1 1 1 1 1 1 1 1 1 1 1 1 1 1
symmnumber: 1
zpe: 727175.8 jmol-1
zpe.correction: 0.276967 hartree
zpe.thermalcorrener: 0.294972 hartree
zpe.thermalcorrenthalpy: 0.295916 hartree
zpe.thermalcorrgfe: 0.229780 hartree
zpe.sumelectzpe: -784.741563 hartree
zpe.sumelectthermal: -784.723557 hartree
zpe.sumelectthermalent: -784.722613 hartree
zpe.sumelectthermalfe: -784.788750 hartree
dipole: -0.6397 -3.7881 2.1078
dipole: 4.3820
quadrupole: -105.9792 -89.4571 -103.8850
quadrupole: 1.6778 -7.4749 5.4887
quadrupole: -6.2055 10.3167 -4.1112 1.6778 -7.4749 5.4887
hfenergy: -785.0185295 hartree
pointgroup: C01 [X(C13H17N1O3)]
dipole: 0.2787161 1.3517144 1.0331269 debye
polarizability: 208.2224803|-1.4774291|178.2205492|-8.3192639|7.2610751|97.3511856 unknown
InChI: InChI=1S/C13H17NO3/c1-4-14(5-2)12(15)10-7-6-8-11(9-10)13(16)17-3/h6-9H,4-5H2,1-3H3
charge 0 multiplicity 1
34 atoms
O  2.631722 -1.302042 -1.344078
O  -2.712945 1.588076 -0.069382
O  -4.259549 -0.121615 0.266397
N  2.449365 0.541622 0.062488
C  3.817499 0.949234 -0.355586
C  1.899433 1.213169 1.265439
C  1.935917 -0.613605 -0.523207
C  0.526196 -1.055044 -0.20083
C  4.928356 0.198612 0.41098
C  1.426241 2.662065 1.017768
C  -0.573356 -0.167345 -0.155053
C  0.294867 -2.449619 -0.067313
C  -1.88587 -0.662317 0.048686
C  -1.009431 -2.943418 0.149962
C  -2.102774 -2.054296 0.211203
C  -3.069923 0.242844 0.096279
C  -3.83978 2.54897 -0.044927
H  3.912476 0.738666 -1.433722
H  3.907085 2.040328 -0.204214
H  1.069687 0.60662 1.662112
H  2.689603 1.217531 2.044092
H  4.855044 0.360124 1.502365
H  4.861905 -0.882422 0.205032
H  5.92242 0.553759 0.082985
H  2.244114 3.296689 0.632471
H  0.596488 2.698827 0.291042
H  1.072269 3.107635 1.965489
H  -0.435598 0.905684 -0.305599
H  1.147149 -3.130962 -0.156655
H  -1.173564 -4.020226 0.261076
H  -3.124961 -2.412962 0.370307
H  -4.356576 2.507284 0.928685
H  -4.560721 2.312745 -0.845404
H  -3.374988 3.531691 -0.206388
