program: Gaussian 09
title: 000182751
version: EM64L-G09RevD.01
frameworkgroup: C1[X(C17H15NO2)]
method: RPBEPBE
basis: SDD
operation: Freq
keyword: #p
keyword: freq=noraman
keyword: PBEPBE/SDD
title: #p freq=noraman PBEPBE/SDD
converged: YES YES NO NO
title: Mulliken charges:
elementType: O O N C C C C C C C C C C C C C C C C C H H H H H H H H H H H H H H H
charge: -0.197255 -0.206894 -0.365764 0.235748 -0.619769 0.381810 0.078646 0.099001 0.037234 0.397616 0.397774 -0.343290 -0.331531 -0.438095 -0.438027 -0.837827 -0.838523 -0.223048 -0.233146 -0.236685 0.271306 0.271097 0.239452 0.280339 0.232199 0.232198 0.254788 0.227594 0.245665 0.227742 0.249098 0.251712 0.224323 0.235709 0.238806
chargesum: 0.00000
title: Mulliken charges with hydrogens summed into heavy atoms:
elementType: O O N C C C C C C C C C C C C C C C C C
charge: -0.197255 -0.206894 -0.365764 0.235748 -0.077366 0.381810 0.078646 0.099001 0.037234 0.397616 0.397774 -0.103839 -0.051192 -0.205896 -0.205830 -0.109780 -0.109972 0.001275 0.002563 0.002121
polarizability: 2.62129681e+02 4.07756465e+00 1.64239832e+02 -1.38503294e+00 -2.35117899e+00 1.44464153e+02
1716.lowfreq: -7.0450 -5.3190 -0.0005 -0.0004 0.0002 4.0535 10.2591 16.6730 45.6254
frequency: 9.1695 16.5114 45.6159 65.8782 111.5032 121.3857 126.5685 134.6884 155.7949 193.8082 208.7073 226.7028 270.9466 314.4339 326.6183 346.4021 373.5568 421.5317 425.1787 462.7423 479.1367 498.1391 521.4452 522.6504 529.9120 543.7996 597.8326 602.2368 625.9973 659.1154 692.5018 729.0403 738.6627 744.7957 779.3574 796.6265 840.7822 858.8180 884.2462 896.0997 920.5978 945.6008 969.6034 980.0629 981.6156 988.7979 1007.6391 1035.7974 1045.1282 1047.0752 1047.6731 1088.6720 1098.6915 1127.0310 1174.1632 1179.0403 1187.5536 1200.6140 1206.6348 1245.6590 1250.3862 1261.1136 1277.1901 1322.1900 1328.1450 1374.5794 1394.4921 1395.3601 1396.0444 1419.5798 1443.6977 1447.8779 1456.5189 1470.9451 1473.0040 1482.8824 1483.0785 1486.3897 1572.4218 1601.3311 1602.7807 1611.9137 1612.8633 1629.9967 2978.6031 2979.3894 2988.7602 3031.6764 3058.1098 3058.6559 3088.7611 3089.1767 3122.7321 3124.4231 3133.7973 3141.8129 3156.2655 3156.8378 3171.4136
redmass: 4.3640 4.3182 4.4971 4.6526 5.0967 2.1612 3.1255 1.3113 1.1028 5.0174 3.3424 2.6614 5.3465 3.0797 4.4205 4.1202 10.2400 3.0453 10.1393 3.1272 3.6209 5.8127 3.1062 4.5841 4.9675 7.1439 4.1647 4.5965 5.5896 6.5211 4.7333 4.7436 2.0169 4.6861 1.2244 1.9732 5.2862 5.0115 1.3750 1.3120 2.4882 2.3203 4.0766 1.4850 1.4274 1.6504 1.3378 2.1254 1.8241 1.6205 1.5393 2.1652 2.4837 2.4929 1.0826 1.1662 3.5652 1.1155 2.1007 2.9255 2.5349 1.5659 2.8901 3.4401 2.0213 6.4725 1.2715 1.4464 3.9131 1.1102 2.2511 2.5418 1.8689 1.0509 1.0473 2.0258 1.4747 1.3817 9.6582 7.3686 6.9397 7.2779 8.1356 9.1926 1.0372 1.0371 1.0613 1.0972 1.0978 1.0979 1.0986 1.0985 1.0855 1.0878 1.0919 1.0896 1.0939 1.0995 1.0999
irintensity: 0.0179 0.1711 5.8029 1.1732 1.9102 4.7739 3.3895 0.6563 0.0555 3.5048 3.1396 0.0154 6.9187 0.9133 0.7742 0.2487 13.7877 1.6290 4.7147 2.2307 0.7227 21.5588 0.1566 2.8946 5.0110 3.1331 1.2480 7.5758 7.7404 14.3668 14.1245 4.9105 45.6974 1.1636 53.3954 25.4482 26.6807 6.9451 2.7744 0.0004 3.0425 8.1381 3.6797 0.7163 4.2085 4.6489 0.0856 14.5276 0.9191 15.7426 0.0331 4.8680 4.2650 36.4231 9.1223 1.9979 56.7159 0.0261 20.5831 163.9682 74.6270 0.4425 10.4458 203.8901 44.2232 7.2819 15.9782 1.7379 1.1377 15.6037 4.4006 26.9641 0.0684 36.5449 13.1174 6.2773 21.3546 28.0460 180.2324 70.8906 56.3802 110.7949 12.6776 33.0712 37.6653 11.2492 3.4199 1.0621 6.3807 16.0737 19.3515 32.7076 0.0628 4.5071 23.7855 11.0485 12.6681 35.2743 23.5587
temp: 298.150 k
press: 1.00000 atm
elementType: 8 8 7 6 6 6 6 6 6 6 6 6 6 6 6 6 6 6 6 6 1 1 1 1 1 1 1 1 1 1 1 1 1 1 1
symmnumber: 1
zpe: 720461.7 jmol-1
zpe.correction: 0.274409 hartree
zpe.thermalcorrener: 0.291973 hartree
zpe.thermalcorrenthalpy: 0.292917 hartree
zpe.thermalcorrgfe: 0.226435 hartree
zpe.sumelectzpe: -860.651767 hartree
zpe.sumelectthermal: -860.634203 hartree
zpe.sumelectthermalent: -860.633259 hartree
zpe.sumelectthermalfe: -860.699741 hartree
dipole: 3.5853 0.5119 -0.1200
dipole: 3.6236
quadrupole: -93.9256 -124.4039 -110.7851
quadrupole: 6.2150 -1.6978 4.4858
quadrupole: 15.7792 -14.6990 -1.0802 6.2150 -1.6978 4.4858
hfenergy: -860.9261761 hartree
pointgroup: C01 [X(C17H15N1O2)]
dipole: 1.4066222 0.2235384 -0.0627074 debye
polarizability: 261.7265902|7.6351756|160.0673552|2.1754971|-8.4695744|149.0397204 unknown
InChI: InChI=1S/C17H15NO2/c1-11-6-5-7-12(2)16(11)18-15(19)10-13-8-3-4-9-14(13)17(18)20/h3-9H,10H2,1-2H3
charge 0 multiplicity 1
35 atoms
O  -0.78417 2.014683 -1.572101
O  0.108439 -1.605977 1.233039
N  -0.32634 0.208127 -0.170198
C  -1.762377 -0.07336 -0.063331
C  1.558254 1.614362 -1.090839
C  2.515397 0.714695 -0.342081
C  2.026342 -0.36384 0.436392
C  0.069302 1.30821 -0.97316
C  0.566803 -0.651471 0.546132
C  -2.341935 -0.998386 -0.966966
C  -2.511271 0.593036 0.938382
C  3.912024 0.937089 -0.407457
C  2.926233 -1.2079 1.139197
C  -3.728972 -1.255709 -0.848206
C  -3.895472 0.309142 1.025448
C  -1.505444 -1.691622 -2.024573
C  -1.854162 1.579614 1.883737
C  -4.501295 -0.607758 0.139725
C  4.806055 0.098745 0.290609
C  4.311924 -0.979087 1.067925
H  1.68409 2.66786 -0.77232
H  1.789668 1.614664 -2.174065
H  4.29853 1.769738 -1.007446
H  2.507789 -2.029675 1.728957
H  -4.200548 -1.967858 -1.535034
H  -4.496335 0.811552 1.792108
H  -0.705949 -2.302363 -1.565629
H  -2.129156 -2.359899 -2.641499
H  -1.022256 -0.960997 -2.699717
H  -2.586723 1.978315 2.605302
H  -1.036201 1.106186 2.45781
H  -1.424064 2.435727 1.331232
H  -5.573896 -0.817304 0.219386
H  5.884483 0.282191 0.231168
H  5.006233 -1.62953 1.609776
