program: Gaussian 09
title: 000182750
version: EM64L-G09RevD.01
frameworkgroup: C1[X(C17H15NO2)]
method: RPBEPBE
basis: SDD
operation: Freq
keyword: #p
keyword: freq=noraman
keyword: PBEPBE/SDD
title: #p freq=noraman PBEPBE/SDD
converged: YES YES NO NO
title: Mulliken charges:
elementType: O O N C C C C C C C C C C C C C C C C C H H H H H H H H H H H H H H H
charge: -0.197707 -0.214067 -0.372171 -0.621833 0.378953 0.398109 0.078106 0.112604 0.067498 0.192194 0.366220 -0.345859 -0.346719 -0.329806 -0.821865 -0.444548 -0.238305 -0.231416 -0.237253 -0.831084 0.269960 0.271128 0.240086 0.239485 0.279872 0.255850 0.229836 0.228916 0.230418 0.227308 0.235388 0.238496 0.228871 0.232477 0.230860
chargesum: 0.00000
title: Mulliken charges with hydrogens summed into heavy atoms:
elementType: O O N C C C C C C C C C C C C C C C C C
charge: -0.197707 -0.214067 -0.372171 -0.080746 0.378953 0.398109 0.078106 0.112604 0.067498 0.192194 0.366220 -0.105772 -0.107233 -0.049934 -0.107264 -0.214130 -0.010998 0.003972 0.001243 -0.138876
polarizability: 2.66833660e+02 -1.71397022e+00 1.73872432e+02 9.46177177e+00 3.42790358e-01 1.36218156e+02
1716.lowfreq: -5.4525 0.0007 0.0009 0.0009 6.2280 6.5972 22.3743 28.6409 47.6622
frequency: 22.3554 28.3699 47.6583 61.0948 83.0176 123.6857 129.2315 143.3964 154.5762 210.0666 215.9891 231.5035 270.7520 311.3294 326.5358 361.2853 373.5271 422.8529 425.2262 462.6256 483.3229 490.7952 507.7843 523.0782 537.2741 552.6870 587.5133 622.2694 628.9385 660.8950 691.3349 722.4062 737.4770 757.7515 783.8020 795.7770 814.8027 852.2340 883.6280 884.4098 902.6220 944.5180 969.1689 977.5589 980.7901 992.4549 1006.8480 1028.0082 1036.3389 1053.8635 1066.6299 1088.4743 1098.6344 1136.8171 1173.6796 1176.0108 1194.7026 1199.3865 1206.0076 1232.0677 1242.8166 1257.4023 1267.0681 1322.9047 1327.7765 1372.5971 1393.6603 1396.0039 1404.0215 1420.6762 1439.9159 1447.6377 1457.8354 1465.5993 1476.9616 1479.7286 1483.2486 1489.3610 1574.6716 1595.2621 1602.5669 1611.7836 1616.9781 1631.2134 2972.2555 2981.1533 2985.3468 3036.5815 3046.9610 3064.5536 3084.5722 3095.5344 3123.9564 3124.7706 3141.8745 3143.2706 3156.3284 3164.7526 3171.5543
redmass: 3.7700 5.6616 4.3800 4.3046 1.2276 3.1325 4.1600 3.2557 1.0895 3.5238 5.9444 2.8637 4.8842 4.2496 2.6176 3.8417 10.0791 3.2593 8.4276 3.1456 3.7335 5.2517 3.1079 4.9043 7.6066 5.2997 3.9260 4.9893 5.8652 6.4573 4.7053 2.3624 2.0512 4.1319 1.5911 2.0074 4.6480 4.3035 1.4038 2.9835 1.4239 2.2977 1.6512 2.3629 1.4366 1.4459 1.3386 1.4712 2.1061 1.6574 2.2635 2.1039 2.4036 2.4661 1.1017 1.2209 2.3268 1.4898 1.9498 2.2013 3.3730 1.7355 2.3477 3.5383 2.0459 6.3439 1.2404 7.3651 1.2369 1.1107 1.7281 2.5384 1.6677 1.4160 1.1225 1.4383 2.5186 1.0887 9.4509 6.7025 8.0697 7.6032 7.0106 9.7093 1.0379 1.0400 1.0635 1.0948 1.0966 1.0937 1.0984 1.0988 1.0876 1.0877 1.0897 1.0908 1.0939 1.0997 1.0999
irintensity: 0.1028 0.1869 5.9536 1.7173 0.9038 0.1938 4.3228 1.6502 0.7897 3.1579 4.5526 2.3670 7.5871 0.3558 0.6972 0.2832 13.4132 2.3807 4.0073 2.5517 1.7577 6.0389 1.2011 15.9451 5.9992 6.8660 3.6881 4.4364 4.7366 12.0025 12.3325 15.0026 42.3286 27.3157 26.4906 23.2556 9.0976 3.6199 3.0537 11.5379 4.0938 7.1591 0.3512 4.8684 4.1533 5.9309 0.1202 17.5754 6.1787 1.8758 7.1144 7.5517 3.2466 63.1359 11.2291 6.5738 25.4498 2.5239 31.2610 32.5286 192.7791 13.5961 13.5778 208.6220 48.6084 0.5271 3.6815 1.2464 23.5776 14.6363 5.7151 26.3343 0.9421 25.1604 15.5822 28.3500 1.2377 16.0056 182.0596 7.9795 99.7677 137.4439 22.5983 40.9784 35.2124 18.6136 3.4030 1.2874 22.5566 11.1133 29.6275 18.3175 10.6645 4.2792 11.5879 20.8387 10.7937 19.5050 23.6412
temp: 298.150 k
press: 1.00000 atm
elementType: 8 8 7 6 6 6 6 6 6 6 6 6 6 6 6 6 6 6 6 6 1 1 1 1 1 1 1 1 1 1 1 1 1 1 1
symmnumber: 1
zpe: 720504.8 jmol-1
zpe.correction: 0.274426 hartree
zpe.thermalcorrener: 0.291922 hartree
zpe.thermalcorrenthalpy: 0.292866 hartree
zpe.thermalcorrgfe: 0.227579 hartree
zpe.sumelectzpe: -860.649210 hartree
zpe.sumelectthermal: -860.631714 hartree
zpe.sumelectthermalent: -860.630770 hartree
zpe.sumelectthermalfe: -860.696057 hartree
dipole: 3.0164 -0.3804 0.8236
dipole: 3.1499
quadrupole: -89.2770 -121.5097 -114.9367
quadrupole: 6.1098 1.6828 -7.2112
quadrupole: 19.2975 -12.9352 -6.3623 6.1098 1.6828 -7.2112
hfenergy: -860.9236357 hartree
pointgroup: C01 [X(C17H15N1O2)]
dipole: 1.1810459 0.0252778 0.3744971 debye
polarizability: 266.4773666|3.7950992|166.1735756|11.1536684|-15.1017589|144.2733055 unknown
InChI: InChI=1S/C17H15NO2/c1-11-6-5-9-15(12(11)2)18-16(19)10-13-7-3-4-8-14(13)17(18)20/h3-9H,10H2,1-2H3
charge 0 multiplicity 1
35 atoms
O  -0.472404 2.71432 -0.44779
O  0.154174 -1.89578 -0.029412
N  -0.147951 0.4069 -0.284262
C  1.830723 1.976937 -0.273377
C  2.707615 0.775465 -0.001261
C  -1.589134 0.185132 -0.437957
C  2.141484 -0.521409 0.076311
C  0.323938 1.746639 -0.335236
C  0.675696 -0.748288 -0.08187
C  -2.392254 -0.089251 0.697289
C  -3.786272 -0.32522 0.492172
C  -2.123908 0.2455 -1.740898
C  4.105374 0.926196 0.165911
C  2.966722 -1.65205 0.314285
C  -1.790546 -0.164422 2.086906
C  -4.319307 -0.265032 -0.818248
C  -3.500533 0.02231 -1.932487
C  4.925123 -0.196887 0.403482
C  4.354436 -1.492704 0.476598
C  -4.699621 -0.64273 1.66396
H  1.995213 2.768106 0.48239
H  2.108647 2.442657 -1.240635
H  -1.464503 0.465285 -2.586608
H  4.551077 1.926584 0.109553
H  2.489765 -2.635914 0.365849
H  -1.576296 -1.216004 2.359954
H  -0.841391 0.392697 2.151967
H  -2.476657 0.244556 2.848146
H  -5.390586 -0.446935 -0.965489
H  -3.930787 0.066922 -2.938427
H  6.005251 -0.065846 0.531623
H  4.991389 -2.36419 0.659849
H  -5.724059 -0.860659 1.317711
H  -4.341333 -1.519476 2.23548
H  -4.759587 0.202793 2.376419
