program: Gaussian 09
title: 000182795
version: EM64L-G09RevD.01
frameworkgroup: C1[X(C24H24ClN3O)]
method: RPBEPBE
basis: SDD
operation: Freq
keyword: #p
keyword: freq=noraman
keyword: PBEPBE/SDD
title: #p freq=noraman PBEPBE/SDD
converged: YES YES NO NO
title: Mulliken charges:
elementType: Cl O N N N C C C C C C C C C C C C C C C C C C C C C C C C H H H H H H H H H H H H H H H H H H H H H H H H
charge: -0.072986 -0.409770 -0.137788 -0.503499 -0.019611 -0.467524 0.351159 -0.326862 -0.312442 -0.124645 0.383645 0.310146 0.268725 -0.328240 -0.090056 0.389215 -0.604433 0.410921 -0.438792 -0.681531 -0.672776 -0.545132 -0.098047 -0.390986 -0.432920 -0.406244 -0.377439 -0.242101 -0.239377 0.234006 0.234578 0.191523 0.225421 0.188753 0.202601 0.304654 0.316763 0.210161 0.269483 0.227826 0.207782 0.212188 0.227810 0.210564 0.208536 0.271407 0.287093 0.241725 0.248046 0.239414 0.385570 0.231561 0.231928
chargesum: 0.00000
title: Mulliken charges with hydrogens summed into heavy atoms:
elementType: Cl O N N N C C C C C C C C C C C C C C C C C C C C C C C C
charge: -0.072986 -0.024201 -0.137788 -0.186736 -0.019611 0.001060 0.351159 0.090082 0.078911 -0.124645 0.383645 0.310146 0.268725 -0.023586 -0.090056 0.389215 -0.394272 0.410921 -0.169309 -0.033735 -0.025866 -0.273726 -0.098047 -0.103893 -0.191195 -0.158199 -0.138025 -0.010540 -0.007449
polarizability: 5.29417051e+02 2.68318661e+00 2.92241496e+02 -3.51704236e+01 3.16858705e+01 2.10062956e+02
1716.lowfreq: -4.7920 -0.0024 -0.0014 -0.0008 2.4887 6.0541 12.4446 22.1489 29.4035
frequency: 12.0209 22.1257 29.3978 36.4324 49.4572 56.8876 75.7554 86.1816 97.2411 106.1615 113.5309 134.1561 167.3865 179.1098 190.9560 198.0723 208.9282 230.4253 246.9799 261.8695 275.0061 288.6184 291.1001 306.5727 315.8664 347.3538 351.6542 362.7424 373.1865 388.7887 408.0683 419.7590 434.8740 459.2241 473.9808 482.4819 500.3240 507.0867 542.1916 550.7839 558.9301 574.4454 582.9635 602.9302 616.0761 623.0884 642.5642 681.0507 716.1953 737.6279 752.0031 757.1486 766.3437 771.8178 783.8186 796.3571 802.3740 802.9704 840.2479 852.2289 857.0867 860.5878 868.2306 890.6696 895.9848 908.6106 928.6479 929.7264 949.7634 960.4732 970.2221 992.9580 997.4648 1004.2803 1016.2098 1044.8790 1066.8485 1071.6516 1077.0111 1082.3567 1086.8188 1114.2560 1141.4137 1165.3694 1166.5788 1173.5266 1177.5895 1200.3363 1204.7709 1227.6109 1239.6515 1246.5234 1262.2842 1274.1824 1284.8631 1287.7943 1294.5121 1310.5187 1322.4509 1349.4174 1358.8911 1364.3355 1368.1376 1372.5844 1388.5826 1390.3773 1392.0357 1398.2372 1414.0875 1416.3893 1436.2701 1444.0069 1454.9704 1460.5982 1465.9436 1468.9295 1472.3555 1475.2567 1479.3007 1485.1797 1492.1102 1501.9852 1540.4770 1556.9006 1572.6956 1588.6025 1605.6460 1609.1447 1638.8927 2856.0746 2864.9252 2898.1452 2983.1922 2985.4548 3020.2689 3026.4333 3041.3456 3075.2071 3078.9119 3088.9219 3091.9517 3105.2597 3119.1697 3121.1301 3129.1448 3145.7145 3153.4776 3158.6613 3159.0200 3162.2725 3164.3110 3440.8028 3548.0726
redmass: 4.2711 4.9801 5.1392 4.6996 4.0539 3.6476 3.9539 2.1101 4.4547 2.5035 4.6615 6.4459 4.1324 3.6924 3.4614 1.7155 2.9304 2.0705 2.8914 4.4425 3.7814 3.7696 1.9474 2.5172 3.4743 4.7949 3.9396 2.1564 2.6043 5.8679 3.0839 5.6083 2.7714 1.7224 2.8233 2.0539 3.6350 3.6333 5.2842 4.3772 6.7896 4.8307 3.7148 5.2391 6.4727 5.1808 6.3794 6.4699 4.9964 3.7559 3.1854 1.5384 3.3140 3.7907 2.2738 1.1414 1.4002 3.3753 4.3883 1.5117 1.6092 1.6334 3.1802 1.6765 1.7718 5.2742 1.7257 1.4266 1.8415 2.2404 1.4100 1.3490 1.7910 2.6298 2.3138 3.0483 2.3171 2.3505 2.0345 1.7244 2.1013 1.8740 1.6399 1.8490 1.5153 1.0871 2.0857 1.9578 2.2871 1.6512 1.5898 2.0206 1.3552 1.6415 1.6978 1.2321 1.4822 3.6817 2.0509 2.0684 1.6059 1.4198 2.3755 1.4734 1.2870 1.5010 2.0407 3.6581 2.3911 3.4073 6.2523 3.0916 1.1373 3.7812 1.0630 1.0577 1.3989 1.6548 1.0621 1.0622 1.0767 2.9049 4.4313 6.0024 5.9415 6.0806 7.4612 5.6010 6.7544 1.0722 1.0717 1.0706 1.0358 1.0357 1.0860 1.0882 1.0877 1.0982 1.0979 1.1003 1.1003 1.0898 1.0898 1.0867 1.0881 1.0952 1.0920 1.0930 1.0936 1.0919 1.1004 1.0665 1.0754
irintensity: 0.0871 0.2619 2.3461 0.0284 0.0296 0.1388 1.5933 1.8063 0.6857 1.3320 0.2359 1.2379 1.0456 2.1663 0.3208 0.9309 3.5727 0.6834 0.4236 2.9172 0.6076 0.7889 1.9598 6.5449 1.7507 2.3214 9.5501 18.8640 19.1548 4.2768 2.5340 0.4899 3.9824 46.4742 3.3649 110.9377 9.1546 5.8838 6.2013 18.0856 18.5450 12.5792 7.2821 1.2539 5.0436 1.9933 5.4982 3.5099 3.7400 22.1830 8.9104 54.7361 2.1351 0.8965 5.8092 5.3055 7.9449 7.1533 1.7793 5.0520 31.7279 28.8955 35.4278 57.3250 3.9651 1.5213 12.4545 14.0847 1.1941 28.1515 11.8727 0.1994 13.3447 3.3511 3.5898 19.6401 0.6889 11.9570 49.0706 12.1897 6.6825 15.5011 12.0691 18.3465 2.5336 0.3727 51.8409 31.3584 49.2523 19.2180 24.6308 10.0360 18.7313 55.6536 5.0685 28.3258 13.8146 13.2706 18.0376 32.6022 5.6650 12.7491 61.4880 0.3517 33.8219 5.3603 35.9135 22.9965 33.0453 21.4459 1.6700 10.0530 4.3809 220.7180 4.9926 8.5717 59.7573 35.7004 1.7621 10.2700 13.7631 63.5980 462.4568 61.6614 78.0969 20.8405 15.3814 18.3051 4.1092 29.7275 160.4137 50.5021 29.8863 32.7632 8.7136 19.2570 14.1110 58.8222 67.5638 52.5266 33.5198 13.4464 23.7731 4.2623 0.0042 26.2603 3.7608 2.3572 9.6007 12.0272 43.3072 300.0853 17.8641
temp: 298.150 k
press: 1.00000 atm
elementType: 17 8 7 7 7 6 6 6 6 6 6 6 6 6 6 6 6 6 6 6 6 6 6 6 6 6 6 6 6 1 1 1 1 1 1 1 1 1 1 1 1 1 1 1 1 1 1 1 1 1 1 1 1
symmnumber: 1
zpe: 1111204.3 jmol-1
zpe.correction: 0.423235 hartree
zpe.thermalcorrener: 0.449932 hartree
zpe.thermalcorrenthalpy: 0.450876 hartree
zpe.thermalcorrgfe: 0.364166 hartree
zpe.sumelectzpe: -1626.431395 hartree
zpe.sumelectthermal: -1626.404698 hartree
zpe.sumelectthermalent: -1626.403754 hartree
zpe.sumelectthermalfe: -1626.490464 hartree
dipole: -0.7269 0.4796 1.5619
dipole: 1.7883
quadrupole: -157.6660 -182.6963 -181.8773
quadrupole: -22.1942 -6.6899 4.2455
quadrupole: 16.4138 -8.6164 -7.7974 -22.1942 -6.6899 4.2455
hfenergy: -1626.8546304 hartree
pointgroup: C01 [X(C24H24Cl1N3O1)]
dipole: -0.261414 -0.6285221 0.1778195 debye
polarizability: 524.6605628|51.6550719|214.5286189|12.0302178|-30.1489458|292.5323212 unknown
InChI: InChI=1S/C24H24ClN3O/c1-3-28(4-2)15-18-11-19(25)14-23(24(18)29)27-21-9-10-26-22-13-17-8-6-5-7-16(17)12-20(21)22/h5-14,27,29H,3-4,15H2,1-2H3
charge 0 multiplicity 1
53 atoms
Cl 3.667625 1.217979 4.006485
O  1.497579 -0.900078 -1.202794
N  5.686273 -0.467365 -0.704998
N  -0.356401 0.083532 0.866808
N  -2.725573 1.421697 -2.458933
C  4.274181 -0.881368 -0.87662
C  3.351901 -0.323036 0.203522
C  5.908025 0.930289 -1.174377
C  6.642704 -1.445631 -1.290163
C  1.946208 -0.327988 -0.002899
C  1.063482 0.164143 1.006181
C  -2.529612 0.140177 -0.29962
C  -1.115233 0.502108 -0.227886
C  3.870903 0.143007 1.431217
C  -3.294052 0.652204 -1.435021
C  -4.565623 -0.967685 0.564937
C  -3.179972 -0.671016 0.656659
C  -5.334147 -0.430186 -0.55093
C  1.600998 0.644823 2.22739
C  7.1624 1.585687 -0.567319
C  6.813716 -2.709217 -0.425375
C  -4.673104 0.358941 -1.524475
C  2.989941 0.611902 2.420372
C  -0.570532 1.267692 -1.276195
C  -5.235586 -1.790215 1.538036
C  -6.740297 -0.732117 -0.634972
C  -1.416043 1.691235 -2.353236
C  -6.596367 -2.062127 1.424785
C  -7.356651 -1.526228 0.327759
H  4.220686 -1.985918 -0.839535
H  3.867299 -0.599512 -1.876717
H  5.955425 0.977891 -2.29208
H  5.023144 1.52026 -0.871419
H  6.34453 -1.734044 -2.329975
H  7.623555 -0.945021 -1.374907
H  4.955374 0.114077 1.571039
H  -0.867449 -0.207173 1.70111
H  -2.623418 -1.124305 1.487634
H  0.934791 1.044003 2.998065
H  7.099237 1.584232 0.535088
H  8.091387 1.061842 -0.856249
H  7.251003 2.632571 -0.912164
H  7.163085 -2.433863 0.584824
H  5.867779 -3.27044 -0.315913
H  7.553564 -3.391996 -0.883362
H  -5.217235 0.762407 -2.384792
H  0.458014 1.637669 -1.230664
H  -4.656989 -2.199148 2.375168
H  -7.31651 -0.324868 -1.473743
H  -0.98109 2.298942 -3.156467
H  0.561205 -0.637731 -1.417064
H  -7.097763 -2.686782 2.171911
H  -8.426467 -1.750154 0.255476
