program: Gaussian 09
title: 000182705
version: EM64L-G09RevD.01
frameworkgroup: C1[X(C6H8O2)]
method: RPBEPBE
basis: SDD
operation: Freq
keyword: #p
keyword: freq=noraman
keyword: PBEPBE/SDD
title: #p freq=noraman PBEPBE/SDD
converged: YES YES NO NO
title: Mulliken charges:
elementType: O O C C C C C C H H H H H H H H
charge: -0.198288 -0.208758 -0.586152 0.229576 0.174065 -0.754624 -0.150494 -0.496514 0.244799 0.255029 0.254922 0.262100 0.243220 0.250901 0.228242 0.251975
chargesum: 0.00000
title: Mulliken charges with hydrogens summed into heavy atoms:
elementType: O O C C C C C C
charge: -0.198288 -0.208758 -0.086324 0.229576 0.174065 0.005618 0.100407 -0.016297
polarizability: 9.36913179e+01 -1.45133204e+00 7.24968313e+01 -7.47936394e+00 -1.61003968e-01 4.90690521e+01
1716.lowfreq: -14.9238 -9.3589 -0.0005 0.0004 0.0006 3.6665 16.0406 48.8313 91.7542
frequency: 10.6805 48.7762 91.7452 146.9179 154.3622 253.0981 342.4841 418.6643 462.6020 481.5162 535.4701 623.7747 720.7661 786.4349 826.1023 903.4475 980.6204 1004.7722 1006.3954 1020.2232 1061.9243 1088.7727 1157.2349 1231.1331 1241.3855 1298.3078 1372.6052 1411.2467 1439.6799 1449.6586 1451.2259 1577.2512 1627.7049 1646.4221 2981.6769 3032.1858 3065.0927 3099.1767 3113.9745 3126.0737 3135.9674 3215.7848
redmass: 4.5131 4.3680 3.0855 1.4871 1.7323 3.3223 3.4561 2.4867 2.0448 3.2397 2.6454 2.4502 3.2608 2.8002 3.1616 1.8197 1.8247 1.4046 1.0827 1.8572 1.6687 1.7088 2.6141 1.3357 1.9573 1.3981 1.2482 1.2317 1.0793 1.0569 1.0792 9.2901 5.5447 5.9125 1.0376 1.0568 1.0954 1.0589 1.1067 1.1008 1.0958 1.1159
irintensity: 8.9089 7.9072 0.8515 0.8192 1.0027 4.2288 2.7314 4.1867 0.3937 9.6858 17.0708 11.5488 3.5362 3.5237 2.1725 30.6235 13.8596 22.8093 58.7164 8.9411 30.5930 46.8323 298.6169 40.4977 57.4743 6.4455 69.9457 73.6217 28.1401 15.0638 19.5909 166.7848 111.5990 30.9296 1.6988 4.1321 5.4014 5.7714 6.1888 9.8251 4.4876 5.4691
temp: 298.150 k
press: 1.00000 atm
elementType: 8 8 6 6 6 6 6 6 1 1 1 1 1 1 1 1
symmnumber: 1
zpe: 326839.7 jmol-1
zpe.correction: 0.124487 hartree
zpe.thermalcorrener: 0.133709 hartree
zpe.thermalcorrenthalpy: 0.134653 hartree
zpe.thermalcorrgfe: 0.087994 hartree
zpe.sumelectzpe: -383.241270 hartree
zpe.sumelectthermal: -383.232048 hartree
zpe.sumelectthermalent: -383.231104 hartree
zpe.sumelectthermalfe: -383.277762 hartree
dipole: 0.3057 0.0855 0.6393
dipole: 0.7138
quadrupole: -42.4572 -55.0930 -45.7514
quadrupole: -10.6634 -1.6048 -0.1926
quadrupole: 5.3100 -7.3258 2.0158 -10.6634 -1.6048 -0.1926
hfenergy: -383.3657567 hartree
pointgroup: C01 [X(C6H8O2)]
dipole: -0.1501816 -0.2068546 -0.1162592 debye
dipolederiv: -0.4955788 -0.086858 0.0063699 -0.1498042 -0.3630843 0.065004 -0.2971442 0.1641433 -0.9663405 -0.5425684 0.0997297 0.0492916 0.2006451 -0.4617818 0.3079174 0.0577629 0.1234799 -0.8365177 -0.9532696 0.2025622 -0.4829915 0.1221077 -0.147609 0.0277095 -0.4643516 0.0723727 -0.2277775 1.0725235 0.3483791 0.1442453 0.7041652 0.2569594 0.008776 0.5311043 -0.221025 1.1770494 1.2615618 -0.5256337 -0.0966485 -0.7974624 0.5770111 -0.4292155 -0.3153175 -0.0932573 0.8155686 -0.322712 -0.1886195 0.153097 -0.2229314 -0.0664064 0.0997063 0.1540308 0.135407 -0.1700942 -0.5898803 0.1454564 0.2230273 0.2889822 -0.2260103 -0.1533733 0.1505828 -0.1430394 -0.0655894 0.0106399 -0.1240413 -0.1409516 -0.227472 -0.0909658 -0.0524742 0.0071166 -0.1350302 0.0511458 0.0619665 0.034387 0.0757676 0.0155988 0.0751104 -0.01321 0.0839825 -0.0502309 -0.0191645 0.0610179 -0.0732627 0.0373326 -0.0585276 -0.0031065 0.0300327 0.0511668 0.0669158 0.0593219 0.0339589 -0.0636014 -0.0493391 -0.098694 0.0569612 -0.0507688 -0.0778698 -0.0789485 0.011615 0.0818801 0.065895 -0.0718109 0.0037277 0.0604443 0.0685157 -0.05907 0.0589717 0.0561653 0.0487205 0.0368737 0.0604209 0.0796219 0.007719 -0.0668079 0.0484307 -0.0641738 0.0866684 0.1068948 0.0571512 -0.0253809 0.0544194 0.0759025 0.089411 0.0408816 0.0708477 -0.0019603 0.0219584 0.0477281 0.0896304 0.0438402 0.1326415 0.0073793 0.1027748 0.0018962 0.021341 0.1428868 0.0238543 0.02794 0.0417835 0.1162144 0.0613977 -0.0140806 0.0916708 0.0085689 unknown
polarizability: 89.7273723|-14.3397036|55.135705|-0.8946665|-7.0227048|70.394124 unknown
InChI: InChI=1S/C6H8O2/c1-3-6(8)4-5(2)7/h3H,1,4H2,2H3
charge 0 multiplicity 1
16 atoms
O  1.407372 -1.125187 1.827609
O  -0.662552 0.140915 -1.726709
C  0.428617 -1.570849 -0.3650
C  1.480347 -0.952077 0.584094
C  -0.671359 -0.529411 -0.654316
C  2.558578 -0.113286 -0.07927
C  -1.695527 -0.34492 0.417381
C  -2.757199 0.490671 0.255915
H  0.896174 -1.849096 -1.323577
H  -0.003997 -2.454788 0.132987
H  3.114393 0.468185 0.672029
H  2.115314 0.558456 -0.837321
H  3.266116 -0.775564 -0.615294
H  -1.551359 -0.912922 1.3447
H  -3.508607 0.627935 1.040706
H  -2.87991 1.048738 -0.680334
