program: Gaussian 09
title: 000182702
version: EM64L-G09RevD.01
frameworkgroup: C1[X(C13H11NO5)]
method: RPBEPBE
basis: SDD
operation: Freq
keyword: #p
keyword: freq=noraman
keyword: PBEPBE/SDD
title: #p freq=noraman PBEPBE/SDD
converged: YES YES NO NO
title: Mulliken charges:
elementType: O O O O O N C C C C C C C C C C C C C H H H H H H H H H H H
charge: -0.212667 -0.114036 -0.213421 -0.169828 -0.190719 -0.276779 -0.379367 0.569959 0.148341 0.286023 0.285620 -0.588566 -0.393321 -0.363140 -0.223926 -0.227169 0.218086 -0.232965 -0.759807 0.311254 0.300696 0.272494 0.240738 0.236215 0.236333 0.235064 0.237946 0.281544 0.256136 0.229264
chargesum: 0.00000
title: Mulliken charges with hydrogens summed into heavy atoms:
elementType: O O O O O N C C C C C C C C C C C C C
charge: -0.212667 -0.114036 -0.213421 -0.169828 -0.190719 -0.276779 -0.068113 0.569959 0.148341 0.286023 0.285620 -0.015376 -0.152583 -0.126925 0.012407 0.007895 0.218086 0.004980 0.007137
polarizability: 1.68013870e+02 -1.73206679e+01 1.63244622e+02 7.52396601e-01 9.37605112e+00 1.29053374e+02
1716.lowfreq: -5.2881 -0.0003 0.0006 0.0009 3.2742 5.7147 20.8600 23.7612 34.2391
frequency: 20.7923 23.6489 34.2316 53.0494 55.7090 87.1532 102.5593 121.5032 131.5036 149.5300 206.1731 209.6252 250.6807 266.5959 325.4652 357.6045 365.0806 401.1896 447.2050 482.1371 487.6940 506.2300 540.6704 566.0179 594.9452 613.3584 639.9039 671.9518 692.0523 700.5939 705.5573 772.0849 788.9317 808.7589 828.2481 837.1307 851.1422 867.4574 905.1425 930.3417 979.0674 991.8189 1002.3674 1003.6577 1021.3227 1026.3855 1041.7368 1083.2170 1096.7404 1163.3825 1167.9251 1177.4252 1193.8369 1195.3721 1208.4580 1244.7893 1248.4901 1304.6950 1325.3155 1344.9325 1370.8225 1388.9586 1401.1229 1447.4508 1447.7832 1454.3158 1483.9429 1598.6859 1611.9309 1615.8494 1645.2694 1711.1235 1778.0938 2985.8609 3001.3949 3054.3137 3062.9254 3072.3198 3117.7690 3127.0216 3134.6803 3144.1202 3156.3747 3171.3569
redmass: 5.4823 3.7955 4.3424 9.6266 4.0078 4.4379 3.6505 3.3120 1.8678 14.8951 4.8356 5.0576 7.5865 6.1018 6.3111 8.8257 2.7265 2.7778 7.0400 3.4804 4.2698 2.9679 5.3122 4.9367 9.4031 6.4661 6.5660 6.9097 6.9687 3.6618 2.1685 2.3013 4.6036 6.0057 5.1727 4.1816 1.2545 1.9990 5.2161 1.5018 1.4230 5.8104 1.6913 1.5605 2.0590 2.2698 2.6613 2.3686 2.8493 3.5544 1.5212 1.0591 1.5642 1.4044 3.3684 2.4502 1.9871 1.5591 2.0699 1.2822 1.2696 6.7911 1.0978 2.1024 1.0789 1.0589 2.2401 6.1077 6.1598 8.9198 8.1786 12.5736 12.8546 1.0373 1.0616 1.0844 1.0970 1.0962 1.0891 1.1003 1.0864 1.0914 1.0962 1.1015
irintensity: 1.2709 0.0125 4.1515 0.5449 2.9912 5.0573 0.4596 4.3864 3.6197 0.3932 15.8309 0.4776 2.9181 1.3731 0.2568 4.3423 0.8498 0.0093 2.2880 5.5849 7.1920 11.0708 24.1351 4.9864 10.4835 2.0455 34.8733 17.7456 23.8263 6.7365 106.9071 9.3307 15.1762 110.3390 129.6629 29.0225 0.2171 4.7364 139.2467 2.4600 0.2108 3.6469 2.2772 0.9196 6.3341 2.1737 27.5645 14.0673 71.0517 103.0535 89.4561 0.1149 35.3926 5.4426 274.1683 56.4260 20.1673 28.1652 298.4641 20.6808 62.3734 2.5230 28.5251 9.8809 26.2099 35.2812 10.2958 1.9003 3.8804 102.0468 159.5223 594.4879 181.5419 3.6566 3.3122 4.6630 4.2349 6.0759 6.1771 11.6118 0.1377 9.4727 22.6472 15.2699
temp: 298.150 k
press: 1.00000 atm
elementType: 8 8 8 8 8 7 6 6 6 6 6 6 6 6 6 6 6 6 6 1 1 1 1 1 1 1 1 1 1 1
symmnumber: 1
zpe: 569446.8 jmol-1
zpe.correction: 0.216891 hartree
zpe.thermalcorrener: 0.234367 hartree
zpe.thermalcorrenthalpy: 0.235311 hartree
zpe.thermalcorrgfe: 0.168267 hartree
zpe.sumelectzpe: -931.507485 hartree
zpe.sumelectthermal: -931.490008 hartree
zpe.sumelectthermalent: -931.489064 hartree
zpe.sumelectthermalfe: -931.556108 hartree
dipole: 2.5928 -4.3111 1.2959
dipole: 5.1949
quadrupole: -131.1308 -116.2151 -104.3287
quadrupole: -10.2898 -1.5523 -6.1152
quadrupole: -13.9059 1.0097 12.8962 -10.2898 -1.5523 -6.1152
hfenergy: -931.7243755 hartree
pointgroup: C01 [X(C13H11N1O5)]
dipole: -1.0468283 -1.6918215 -0.468197 debye
polarizability: 168.9296818|17.6428404|161.2028014|1.3194792|-10.3181974|130.1793821 unknown
InChI: InChI=1S/C13H11NO5/c1-8(15)7-10(16)14-11(12(17)19-13(14)18)9-5-3-2-4-6-9/h2-6,11H,7H2,1H3
charge 0 multiplicity 1
30 atoms
O  -0.538917 2.888392 -0.571382
O  -2.504764 2.712487 0.692314
O  1.241877 -0.895976 1.234444
O  1.619387 2.498961 -1.412835
O  4.98035 -0.643563 0.654805
N  0.533377 0.964854 0.078384
C  -0.824195 0.850904 0.688364
C  -1.655426 -0.311928 0.142941
C  -1.441028 2.214787 0.338626
C  1.534139 -0.002988 0.399153
C  0.674294 2.123301 -0.713875
C  2.88983 0.150286 -0.276716
C  -2.078455 -1.339829 1.01569
C  -2.011059 -0.359878 -1.2283
C  -2.856596 -2.410345 0.523169
C  -2.784506 -1.432372 -1.719813
C  3.895268 -0.955989 0.10357
C  -3.210175 -2.459109 -0.84447
C  3.537217 -2.386953 -0.250553
H  -0.72988 0.751988 1.783962
H  3.328618 1.129562 -0.011325
H  2.751308 0.17321 -1.375448
H  -1.787098 -1.311995 2.071428
H  -1.697195 0.437517 -1.914298
H  -3.180605 -3.20564 1.202588
H  -3.061338 -1.465052 -2.778943
H  -3.813936 -3.289505 -1.226204
H  2.68492 -2.710148 0.375569
H  4.398473 -3.047398 -0.068804
H  3.217016 -2.468081 -1.306241
