program: Gaussian 09
title: 000182696
version: EM64L-G09RevD.01
frameworkgroup: C1[X(C11H12N2O2)]
method: RPBEPBE
basis: SDD
operation: Freq
keyword: #p
keyword: freq=noraman
keyword: PBEPBE/SDD
title: #p freq=noraman PBEPBE/SDD
converged: NO YES NO NO
title: Mulliken charges:
elementType: O O N N C C C C C C C C C C C H H H H H H H H H H H H
charge: -0.362418 -0.252320 -0.076668 -0.370872 0.406596 0.406608 0.050934 0.457780 -0.566779 -0.566889 -0.803702 -0.803704 0.271162 -0.601282 -0.224063 0.260768 0.260782 0.247861 0.229629 0.244392 0.229623 0.247864 0.244392 0.334307 0.231801 0.272262 0.231937
chargesum: 0.00000
title: Mulliken charges with hydrogens summed into heavy atoms:
elementType: O O N N C C C C C C C C C C C
charge: -0.362418 -0.252320 -0.076668 -0.036565 0.406596 0.406608 0.050934 0.457780 -0.306011 -0.306108 -0.081820 -0.081824 0.271162 0.134718 -0.224063
polarizability: 2.17660365e+02 -2.75410463e-03 1.29662023e+02 -1.57064975e+01 7.81202990e-03 8.67626799e+01
1716.lowfreq: -40.5724 -9.6160 -1.1983 -0.0003 0.0004 0.0007 4.2280 42.2212 52.4829
frequency: -40.4641 42.2005 52.4683 95.9061 106.9329 122.5068 124.4176 141.4532 155.0734 188.0408 225.2207 233.7835 266.4679 278.0653 295.8842 333.1518 411.0992 460.7240 480.3102 501.8938 518.5822 571.9476 590.0284 608.7107 615.9523 678.4680 684.6018 714.6740 746.0346 850.0994 879.2382 898.8782 957.3147 959.3120 1015.3169 1046.1114 1046.8977 1047.2781 1067.0671 1126.9706 1128.3948 1149.1203 1174.3558 1197.1820 1237.1993 1312.6173 1367.8034 1404.4373 1405.2947 1428.7892 1429.7103 1432.9283 1459.6899 1465.2945 1465.6966 1481.8910 1483.4577 1485.1934 1514.3751 1596.4431 1611.5049 1711.0654 2038.2477 2982.9735 2984.3998 2984.7714 3061.0162 3061.0647 3061.9624 3100.4669 3100.8031 3115.2380 3158.9606 3161.4745 3575.7931
redmass: 5.3477 4.3292 6.3959 1.1132 4.6096 1.0335 1.0521 6.9955 3.2367 3.6953 2.9067 4.4150 4.1573 4.0577 4.7690 5.3881 6.3044 7.8274 5.7863 4.6749 3.0981 4.9205 1.1276 4.4817 5.3098 4.5591 12.1579 5.4105 3.6843 3.4772 1.3029 1.7616 2.8447 3.5321 1.7811 1.7842 1.5704 1.5693 4.1575 1.2825 2.3833 1.7055 3.3269 2.1230 1.3358 6.0385 7.4957 1.3114 1.2173 2.6241 2.3190 1.1576 1.3294 1.0442 1.0436 1.2463 1.0443 1.3077 1.3861 9.1428 5.9864 9.6919 13.0179 1.0353 1.0378 1.0378 1.0970 1.0971 1.1028 1.0992 1.0991 1.0985 1.0929 1.0932 1.0772
irintensity: 2.0817 4.7925 0.2255 0.2583 9.5232 0.0076 0.5156 7.7562 0.5206 0.1411 0.0190 3.7263 0.6321 0.1671 0.7092 22.2413 2.7539 2.6617 0.7744 0.1195 0.0117 6.3010 125.1936 3.9125 3.7452 0.9315 23.1193 1.8029 5.1568 32.0389 0.1388 49.2079 4.1465 43.6123 20.2384 0.1387 0.0037 13.2837 360.9909 0.4906 248.5777 14.2437 125.8886 129.9938 0.1107 63.2474 7.7675 16.9690 10.0853 0.8595 30.3121 29.3336 188.4464 33.7064 0.0147 19.7155 13.1344 64.4943 151.1101 26.1336 36.3250 296.1333 106.2694 85.3591 24.7832 3.6308 0.1144 23.7146 34.4604 19.6674 14.6013 4.0923 3.2600 4.9733 44.7393
temp: 298.150 k
press: 1.00000 atm
elementType: 8 8 7 7 6 6 6 6 6 6 6 6 6 6 6 1 1 1 1 1 1 1 1 1 1 1 1
symmnumber: 1
zpe: 547104.3 jmol-1
zpe.correction: 0.208381 hartree
zpe.thermalcorrener: 0.223314 hartree
zpe.thermalcorrenthalpy: 0.224258 hartree
zpe.thermalcorrgfe: 0.165989 hartree
zpe.sumelectzpe: -685.206711 hartree
zpe.sumelectthermal: -685.191778 hartree
zpe.sumelectthermalent: -685.190834 hartree
zpe.sumelectthermalfe: -685.249103 hartree
dipole: 5.2714 -0.0031 -2.5912
dipole: 5.8738
quadrupole: -90.4078 -77.2843 -92.9303
quadrupole: 0.0023 -2.8436 -0.0083
quadrupole: -3.5336 9.5899 -6.0562 0.0023 -2.8436 -0.0083
hfenergy: -685.415092 hartree
pointgroup: C01 [X(C11H12N2O2)]
dipole: 2.0950903 -0.0008585 -0.9752315 debye
polarizability: 218.2675079|0.0074164|129.6620196|-12.9171115|0.0133819|86.1555396 unknown
InChI: InChI=1S/C11H12N2O2/c1-7-5-9(15-11(14)13-4)6-8(2)10(7)12-3/h5-6,13H,1-2,4H3
charge 0 multiplicity 1
27 atoms
O  2.00732 -0.001129 -0.834105
O  2.639972 0.001366 1.46149
N  -3.494827 0.000154 0.226215
N  4.210663 -0.000738 -0.296341
C  -1.443713 1.250913 -0.137043
C  -1.444231 -1.251517 -0.13681
C  -2.118737 -0.000152 -0.018011
C  0.620013 -0.000763 -0.507016
C  -0.053932 1.228915 -0.386043
C  -0.054437 -1.230139 -0.385806
C  -2.200518 2.554852 0.002311
C  -2.201564 -2.555119 0.00283
C  2.951791 -0.00014 0.25074
C  5.420138 0.001048 0.531681
C  -4.683698 0.000443 0.437715
H  0.506434 2.163621 -0.484469
H  0.50555 -2.16509 -0.484076
H  -2.683636 2.633381 0.993993
H  -1.527698 3.41868 -0.12187
H  -3.008614 2.633641 -0.748636
H  -1.52919 -3.419249 -0.12167
H  -2.684267 -2.633458 0.994732
H  -3.010037 -2.633522 -0.747748
H  4.278162 -0.001588 -1.314349
H  6.037198 -0.896016 0.340654
H  5.10946 -0.003318 1.588344
H  6.031197 0.903522 0.346587
