program: Gaussian 09
title: 000182687
version: EM64L-G09RevD.01
frameworkgroup: C1[X(C11H15NOS)]
method: RPBEPBE
basis: SDD
operation: Freq
keyword: #p
keyword: freq=noraman
keyword: PBEPBE/SDD
title: #p freq=noraman PBEPBE/SDD
converged: YES YES NO NO
title: Mulliken charges:
elementType: S O N C C C C C C C C C C C H H H H H H H H H H H H H H H
charge: 0.088305 -0.218027 -0.091447 -0.371608 -0.357424 -0.640135 -0.650506 -0.007411 -0.106393 -0.182861 -0.272989 -0.227522 -0.210441 -0.232436 0.221652 0.247716 0.211287 0.257492 0.243721 0.212514 0.218318 0.247533 0.208474 0.218777 0.260333 0.249214 0.227854 0.227805 0.228205
chargesum: 0.00000
title: Mulliken charges with hydrogens summed into heavy atoms:
elementType: S O N C C C C C C C C C C C
charge: 0.088305 -0.218027 -0.091447 0.097760 0.111354 0.034418 0.024278 -0.007411 -0.106393 0.077472 -0.023774 0.000332 0.017364 -0.004231
polarizability: 2.16116879e+02 4.11009639e+00 1.42530986e+02 -9.22132213e+00 3.31006108e+00 8.95758260e+01
1716.lowfreq: -6.5011 -0.0020 0.0008 0.0011 3.7734 13.1143 28.4921 31.4012 52.3010
frequency: 28.4731 31.3952 52.2433 73.6610 79.8207 92.8177 129.5554 187.1323 207.2567 212.8299 238.0811 264.0054 312.9076 336.8518 397.5101 403.0511 422.4563 447.3466 486.3581 508.0933 610.6889 617.3615 633.1180 679.4474 691.4988 750.2583 772.7610 782.0381 827.1782 840.2575 914.3275 939.7165 969.1554 985.2556 991.9085 1002.9178 1016.5437 1070.3782 1075.5078 1076.3363 1080.0931 1095.1634 1106.3804 1171.5326 1185.3526 1206.1737 1237.3833 1295.1914 1305.2056 1339.2736 1355.4591 1376.5277 1381.7673 1386.2691 1388.8376 1426.3237 1459.7065 1461.2040 1467.6978 1468.7553 1479.0017 1482.0119 1491.3804 1588.3416 1589.2304 1642.8829 2985.8991 2986.7081 3000.8341 3009.4627 3053.9622 3070.2911 3083.3776 3086.2665 3099.6921 3102.8190 3126.7473 3138.2337 3151.4739 3164.1738 3180.7098
redmass: 3.7475 5.0196 3.2151 3.4099 4.0476 4.4285 3.5730 1.9127 1.4452 1.8418 1.8357 4.3421 2.7519 3.2853 5.7598 2.9608 4.3160 3.7504 3.6955 3.9220 6.4689 9.6809 4.1029 6.3176 2.1660 1.5532 1.4129 1.1661 2.0666 1.2500 1.3798 2.0874 1.3913 5.2274 1.3768 2.7037 3.3273 2.1857 1.7827 1.9211 1.9112 1.8692 2.0085 1.0528 1.1152 2.9096 1.6654 1.2768 1.3059 1.2683 1.2854 7.8637 1.9189 1.2186 1.2646 2.1135 1.0757 2.0638 1.0488 1.0452 1.0535 1.0590 1.0906 6.2804 6.0508 9.3404 1.0358 1.0356 1.0618 1.0629 1.1016 1.1001 1.0996 1.0991 1.1013 1.1022 1.0848 1.0891 1.0942 1.0991 1.0971
irintensity: 0.3289 2.5016 0.6111 0.9502 1.5288 2.4065 0.0869 0.3181 0.3348 1.3232 2.0093 0.3043 4.2463 22.9284 2.4314 0.5539 1.2012 6.4859 6.7511 10.3477 0.3299 10.0399 34.9228 8.5241 38.9074 74.7374 4.2242 2.2962 95.1345 0.3751 1.4976 9.8055 0.6722 6.1174 0.3146 8.4217 27.7045 61.7001 16.7663 0.5576 8.1937 49.5149 110.1780 0.0221 1.9600 63.1697 115.6816 27.6061 1.8434 5.6143 8.9882 8.8019 115.4884 1.1317 46.4327 11.3781 20.6733 27.1608 2.9962 11.3097 10.2098 13.1233 18.0881 3.1319 5.3995 251.7496 26.5683 26.0390 31.1484 36.9467 9.2453 6.4894 38.4081 37.0298 24.2334 40.7707 0.0794 9.6913 26.9258 28.0358 4.9609
temp: 298.150 k
press: 1.00000 atm
elementType: 16 8 7 6 6 6 6 6 6 6 6 6 6 6 1 1 1 1 1 1 1 1 1 1 1 1 1 1 1
symmnumber: 1
zpe: 621258.4 jmol-1
zpe.correction: 0.236625 hartree
zpe.thermalcorrener: 0.251808 hartree
zpe.thermalcorrenthalpy: 0.252752 hartree
zpe.thermalcorrgfe: 0.192363 hartree
zpe.sumelectzpe: -955.155429 hartree
zpe.sumelectthermal: -955.140246 hartree
zpe.sumelectthermalent: -955.139302 hartree
zpe.sumelectthermalfe: -955.199691 hartree
dipole: 2.6912 0.9793 -0.3707
dipole: 2.8877
quadrupole: -69.9178 -88.2309 -94.8289
quadrupole: 1.3166 -1.8971 3.9568
quadrupole: 14.4080 -3.9050 -10.5031 1.3166 -1.8971 3.9568
hfenergy: -955.3920535 hartree
pointgroup: C01 [X(C11H15N1O1S1)]
dipole: 1.0758749 -0.332337 0.1510716 debye
polarizability: 216.3679279|-0.4680743|142.4403911|8.8697746|2.6402967|89.415372 unknown
InChI: InChI=1S/C11H15NOS/c1-3-12(4-2)11(13)14-10-8-6-5-7-9-10/h5-9H,3-4H2,1-2H3
charge 0 multiplicity 1
29 atoms
S  0.052389 -0.959706 0.845478
O  0.561302 1.385837 -0.586094
N  2.450023 0.177668 0.068138
C  3.072876 -0.984622 0.744181
C  3.354292 1.170739 -0.574476
C  3.307888 -2.180843 -0.202445
C  3.772374 2.299464 0.390198
C  1.093562 0.401065 -0.017299
C  -1.651594 -0.398646 0.436849
C  -2.099286 0.905296 0.747789
C  -2.530762 -1.345039 -0.139752
C  -3.439327 1.261071 0.473344
C  -3.874593 -0.985433 -0.394358
C  -4.330196 0.318494 -0.091513
H  4.033459 -0.638865 1.170281
H  2.443145 -1.29071 1.598373
H  4.240136 0.622296 -0.94555
H  2.825214 1.595843 -1.443815
H  2.348155 -2.551611 -0.601117
H  3.952865 -1.896979 -1.053782
H  3.801508 -3.007325 0.340944
H  2.886062 2.867652 0.719808
H  4.285147 1.899565 1.284092
H  4.462963 2.998318 -0.116439
H  -1.410234 1.63312 1.183154
H  -2.16656 -2.346878 -0.389566
H  -3.785692 2.274236 0.705425
H  -4.55668 -1.719866 -0.836868
H  -5.369638 0.598656 -0.295985
