program: Gaussian 09
title: 000182759
version: EM64L-G09RevD.01
frameworkgroup: C1[X(C20H32O6)]
method: RPBEPBE
basis: SDD
operation: Freq
keyword: #pfreq=noraman
keyword: PBEPBE/SDD
title: #p freq=noraman PBEPBE/SDD
converged: YES YES NO NO
title: Mulliken charges:
elementType: O O O O O O C C C C C C C C C C C C C C C C C C C C H H H H H H H H H H H H H H H H H H H H H H H H H H H H H H H H
charge: -0.433771 -0.496262 -0.465581 -0.428457 -0.471632 -0.435828 0.433700 -0.349999 -0.263865 -0.182114 0.093603 -0.692349 0.299673 -0.643522 -0.355570 -0.137087 0.298700 -0.471932 0.607801 -0.466507 -0.249000 -0.186292 -0.789222 -0.812848 -0.743247 -0.875310 0.200528 0.256623 0.240532 0.235671 0.252159 0.208991 0.260394 0.242350 0.241752 0.217583 0.257456 0.212199 0.203633 0.272993 0.242249 0.244774 0.216025 0.208255 0.261250 0.199933 0.239968 0.224142 0.243820 0.218769 0.330035 0.357055 0.333330 0.296379 0.224636 0.356213 0.359486 0.357739
chargesum: 0.00000
title: Mulliken charges with hydrogens summed into heavy atoms:
elementType: O O O O O O C C C C C C C C C C C C C C C C C C C C
charge: -0.103736 -0.139206 -0.132251 -0.072244 -0.112146 -0.078090 0.433700 -0.149472 -0.007242 0.058418 0.093603 -0.204520 0.299673 -0.174137 -0.113219 0.104664 0.298700 0.003108 0.607801 -0.050675 0.023993 0.055957 -0.120168 -0.111697 -0.056516 -0.354296
polarizability: 2.53992997e+02 1.32191048e-01 2.18259827e+02 -4.86388726e+00 -1.06560993e+01 1.97055448e+02
1716.lowfreq: -12.7885 -0.0006 0.0001 0.0005 1.5334 9.9691 44.3287 53.4518 73.9950
frequency: 44.3147 53.4174 73.8201 107.4503 114.0609 138.0858 153.5082 158.7655 180.2060 183.7842 190.2717 201.5458 227.9265 243.7624 245.0512 256.1161 262.4849 276.0277 280.5811 292.7271 299.0740 306.5495 313.0325 319.5467 325.6372 330.2369 336.7518 342.5578 358.1174 361.4884 374.2798 401.8877 413.5928 423.0968 434.2288 440.6427 447.3805 474.8843 484.6946 501.4484 525.8710 556.8356 567.0557 580.2067 581.3550 597.8508 617.8936 652.3922 668.3696 701.5515 704.5963 735.4857 760.1684 775.4970 788.8535 804.6306 819.1396 821.4695 837.4998 853.8811 860.6285 870.5942 889.8344 912.2943 917.3593 936.8408 942.1964 943.0245 953.2037 954.7168 975.3103 984.7698 994.9561 999.6187 1005.9407 1015.2163 1023.6335 1028.8692 1034.5705 1038.2476 1055.2172 1068.2558 1076.6682 1084.0463 1097.9039 1106.5324 1116.9231 1121.3878 1156.2466 1161.2570 1166.5784 1173.6416 1193.6889 1201.9827 1203.9347 1206.6104 1208.8533 1215.1454 1223.1088 1228.6404 1234.7395 1244.8874 1266.9061 1273.2003 1282.8048 1283.2378 1290.2596 1297.2485 1304.9983 1308.4333 1317.9974 1330.9179 1333.2145 1340.2413 1349.1362 1356.7869 1367.3847 1376.0025 1385.6411 1390.7074 1391.5564 1396.6478 1399.4381 1406.8935 1433.1145 1457.1357 1459.7144 1462.3377 1462.9183 1470.0289 1473.5230 1476.0075 1482.6750 1486.2841 1499.5710 1624.4706 2950.9853 2961.6661 2967.8414 2970.8806 2980.1351 2983.9248 3000.5209 3000.8013 3005.9522 3021.3211 3021.8564 3036.0569 3042.2911 3052.4614 3057.1493 3058.8546 3068.5422 3075.6481 3076.0836 3079.8051 3080.7587 3084.6164 3086.8673 3100.0963 3103.4996 3195.1620 3308.3354 3394.3142 3435.4133 3481.4634 3552.7358 3561.1779
redmass: 4.4682 4.1103 4.1262 3.7596 4.6308 4.0648 3.4426 3.8071 1.5671 1.8767 3.6604 4.3107 2.6081 2.0467 2.3219 2.2837 3.2004 1.5331 2.6348 2.8084 1.5419 3.5960 3.4897 2.7415 2.6403 3.1735 3.2909 2.4386 2.5872 1.5794 3.6966 2.5213 3.1308 3.1006 3.6849 2.5089 2.8163 1.9433 2.0338 3.3195 1.2267 3.2688 3.4151 1.2150 3.3084 2.7553 2.6409 3.3857 3.5462 3.8067 3.1836 1.3562 2.8397 3.0755 3.6516 2.5770 1.8219 1.8338 3.2882 1.8814 2.7122 2.6938 2.5227 2.0758 2.7905 2.3490 1.7394 2.1040 2.1299 2.3542 3.0273 1.8466 1.7860 1.5867 2.4200 2.2523 1.7825 2.3054 2.1250 2.0974 3.1602 1.8752 1.8200 4.0247 2.5209 1.8695 2.2745 2.0289 2.2804 1.7182 1.6225 1.5645 1.8974 1.8550 1.4556 1.8535 1.7651 1.3859 1.4118 1.6817 1.7173 1.7575 1.5762 1.4364 1.4515 1.7137 1.5137 1.5394 1.3544 1.4461 1.4199 1.5733 1.3773 1.7889 1.4330 1.4601 1.3099 1.1980 1.2182 1.1839 1.2008 1.1930 1.1507 1.2070 1.1913 1.0653 1.0745 1.0585 1.0833 1.0477 1.0539 1.0807 1.0809 1.0505 1.0519 4.6939 1.0814 1.0665 1.0378 1.0374 1.0629 1.0683 1.0444 1.0712 1.0620 1.0859 1.0864 1.0923 1.0976 1.0881 1.0957 1.0961 1.1017 1.0893 1.0906 1.0841 1.0673 1.0998 1.1000 1.0998 1.0993 1.1140 1.0662 1.0639 1.0642 1.0646 1.0659 1.0654
irintensity: 0.3708 0.2491 1.1170 1.1442 1.1703 2.7361 14.5572 11.6688 1.3696 0.5845 1.1402 14.3198 3.8334 14.9868 12.2950 33.6641 9.6518 54.0923 24.4699 13.3962 71.0115 20.9628 12.4051 20.0226 14.9162 2.8341 1.3898 3.4306 8.9999 6.1081 13.4679 11.0362 7.6344 3.1212 12.5819 23.3949 11.9642 10.8286 13.0244 10.1533 157.5131 3.4896 12.0695 119.9012 1.7870 13.7897 1.9070 24.3126 17.8048 5.8694 8.1501 23.6422 7.4329 3.7024 5.2612 33.9134 89.8955 19.9035 34.5680 37.0360 6.1922 8.0420 15.2121 4.6955 17.0180 30.5609 9.3196 11.2176 47.6382 32.5876 67.1587 28.9132 28.7989 26.3017 14.3302 26.8683 8.8752 59.7675 40.3590 23.4292 20.3513 53.9885 5.8400 21.0808 2.0784 34.8179 0.6821 5.9783 8.0260 8.8154 12.2037 23.2889 2.3920 7.6181 25.3823 7.6168 21.6502 19.8242 51.9723 45.9487 10.3460 5.0436 16.6223 5.2207 12.4282 13.8462 21.1381 18.0536 3.5918 4.4141 2.7938 16.2271 1.0455 7.7895 4.6495 10.6256 10.7470 11.1704 42.4729 28.8012 33.4930 21.2439 11.4344 109.3964 10.7724 12.0025 8.7155 9.5521 12.0227 1.5577 2.9843 23.0652 11.2311 12.8125 16.9523 25.5039 13.6618 27.5399 22.9910 25.6467 31.0891 29.0395 17.5572 11.0534 30.6103 23.1112 39.9735 7.6638 33.5817 26.2249 37.1493 36.3018 25.0154 19.1719 13.5458 30.4462 22.1956 23.3415 10.5366 21.3148 20.7095 1.8644 89.4186 47.5142 26.1368 18.9820 3.0249 5.3780
temp: 298.150 k
press: 1.00000 atm
elementType: 8 8 8 8 8 8 6 6 6 6 6 6 6 6 6 6 6 6 6 6 6 6 6 6 6 6 1 1 1 1 1 1 1 1 1 1 1 1 1 1 1 1 1 1 1 1 1 1 1 1 1 1 1 1 1 1 1 1
symmnumber: 1
zpe: 1299063.0 jmol-1
zpe.correction: 0.494787 hartree
zpe.thermalcorrener: 0.520131 hartree
zpe.thermalcorrenthalpy: 0.521075 hartree
zpe.thermalcorrgfe: 0.444610 hartree
zpe.sumelectzpe: -1230.563912 hartree
zpe.sumelectthermal: -1230.538568 hartree
zpe.sumelectthermalent: -1230.537624 hartree
zpe.sumelectthermalfe: -1230.614089 hartree
dipole: -5.0676 1.1094 0.2501
dipole: 5.1936
quadrupole: -166.0299 -165.3927 -161.5615
quadrupole: -6.3858 -17.5865 -10.0027
quadrupole: -1.7019 -1.0647 2.7665 -6.3858 -17.5865 -10.0027
hfenergy: -1231.0586988 hartree
pointgroup: C01 [X(C20H32O6)]
dipole: -2.0022007 -0.3997605 -0.0812192 debye
polarizability: 254.0518702|-0.880574|218.2759824|4.1788705|-10.7373017|196.9804203 unknown
InChI: InChI=1S/C20H32O6/c1-9-10-5-6-11-15(23)19(10,8-18(11,4)25)7-12(21)20(26)13(9)14(22)16(24)17(20,2)3/h10-16,21-26H,1,5-8H2,2-4H3
charge 0 multiplicity 1
58 atoms
O  -3.452828 1.685721 1.603071
O  2.425056 0.074171 1.67896
O  -3.15554 -0.47066 -2.39936
O  1.42047 2.604005 1.472359
O  3.43071 -2.061337 0.261284
O  4.586206 -0.714635 -1.783851
C  -1.553428 0.240422 0.674287
C  -1.189075 -1.289093 0.807842
C  -3.024227 0.328695 1.229504
C  -3.839354 -0.296819 0.060447
C  1.769639 0.444515 0.370892
C  -1.781711 0.748302 -0.798816
C  -3.254719 0.416526 -1.21079
C  -0.546389 1.111774 1.472429
C  1.201567 -0.894851 -0.235473
C  0.731342 1.547437 0.709441
C  2.915969 0.893044 -0.644183
C  -2.065466 -2.159552 -0.136423
C  0.29696 -1.665113 0.718853
C  -3.570376 -1.826553 0.036511
C  2.488314 -1.573705 -0.774608
C  3.188974 -0.411502 -1.524172
C  -4.074056 1.654798 -1.633118
C  2.443596 2.020564 -1.599238
C  4.201044 1.380327 0.06695
C  0.766652 -2.669948 1.51567
H  -1.487967 -1.5583 1.84433
H  -3.157539 -0.233845 2.169232
H  -4.919993 -0.097958 0.189851
H  -1.619594 1.842885 -0.849336
H  -1.108382 0.296762 -1.544589
H  -0.275367 0.597098 2.418508
H  -1.036977 2.054335 1.780984
H  0.621186 -0.619665 -1.13797
H  0.423335 2.043195 -0.22341
H  -1.885365 -3.22742 0.087417
H  -1.777892 -1.994049 -1.18937
H  -4.144026 -2.302117 -0.780002
H  -3.945732 -2.257208 0.986953
H  2.285469 -2.447065 -1.41372
H  2.735958 -0.274987 -2.523141
H  -3.571715 2.179755 -2.465103
H  -5.085514 1.356585 -1.972637
H  -4.225072 2.367522 -0.80208
H  2.266761 2.96424 -1.054479
H  1.524846 1.750099 -2.155699
H  3.236644 2.198745 -2.348302
H  3.998403 2.320388 0.608633
H  4.98169 1.560308 -0.691303
H  4.596322 0.647668 0.788702
H  -3.199884 2.328447 0.893208
H  1.773122 -0.511028 2.163432
H  -4.068215 -0.646001 -2.743617
H  1.792392 -3.041641 1.434117
H  0.089842 -3.184636 2.210253
H  2.008248 2.129016 2.121489
H  3.425357 -1.372809 0.993212
H  4.883631 -1.283853 -1.019027
