program: Gaussian 09
title: 000182679
version: EM64L-G09RevD.01
frameworkgroup: C1[X(C16H12O4)]
method: RPBEPBE
basis: SDD
operation: Freq
keyword: #pfreq=noraman
keyword: PBEPBE/SDD
title: #p freq=noraman PBEPBE/SDD
converged: YES YES NO NO
title: Mulliken charges:
elementType: O O O O C C C C C C C C C C C C C C C C H H H H H H H H H H H H
charge: -0.559578 -0.418960 -0.422744 -0.194107 -0.021804 0.013965 0.528662 0.540772 0.122956 -0.805958 0.345970 0.129335 -0.479210 -0.501149 -0.364170 -0.229969 -0.384596 -0.201875 0.289096 -0.767304 0.248940 0.249467 0.244961 0.300159 0.233776 0.251705 0.226458 0.435797 0.407066 0.257962 0.267124 0.257256
chargesum: 0.00000
title: Mulliken charges with hydrogens summed into heavy atoms:
elementType: O O O O C C C C C C C C C C C C C C C C
charge: -0.123781 -0.418960 -0.015678 -0.194107 -0.021804 0.013965 0.528662 0.540772 0.122956 -0.557018 0.345970 0.129335 -0.229742 -0.256188 -0.064012 0.003807 -0.132892 0.024582 0.289096 0.015038
polarizability: 3.26626469e+02 -1.90366333e+01 2.33895507e+02 1.60055130e-01 4.13974800e-02 7.64722008e+01
1716.lowfreq: -3.8863 -0.0008 -0.0007 -0.0005 4.9743 8.1883 27.4980 47.8871 82.0051
frequency: 27.4254 47.8866 82.0031 85.3783 99.3084 110.6495 140.1123 203.8106 226.4088 248.0250 252.6175 298.6204 304.0507 331.2833 353.3363 419.8460 425.2025 475.5598 485.5936 495.0121 499.0695 523.3797 545.3758 569.1627 583.6215 584.6421 602.0861 619.7071 636.3495 679.5106 723.1625 739.7765 749.0414 750.9718 768.6552 782.3033 795.3782 810.0559 836.3116 869.3864 900.3960 901.2854 929.5645 972.4862 982.0539 983.6323 1013.0500 1032.6334 1037.9862 1049.8031 1066.1505 1099.3062 1142.7247 1173.7466 1176.1193 1191.8124 1218.5816 1232.2437 1296.2387 1313.5793 1340.4365 1354.2270 1383.8514 1387.6512 1412.3149 1428.9583 1437.4485 1444.0180 1451.0875 1458.1363 1459.3126 1495.8966 1561.4617 1573.6773 1595.1950 1627.8251 1645.8235 1687.8602 3003.2343 3090.2104 3130.8285 3132.9597 3135.4396 3143.7007 3152.7118 3161.6314 3176.5433 3212.3785 3220.7723 3253.1848
redmass: 8.1756 3.5404 3.7341 1.5507 2.9827 4.8176 6.9423 4.3852 6.3082 5.1657 7.7256 4.9837 4.6231 4.3692 5.8416 5.6004 8.0054 5.5519 4.4670 3.6815 6.1030 6.2201 3.1807 7.2756 4.9599 4.8260 3.8629 3.7407 6.3511 6.2105 1.9096 1.2821 6.5014 1.1088 1.3300 6.4569 2.4358 1.7485 7.3852 1.4684 5.5463 1.5083 1.6357 1.3410 1.3708 2.3160 4.9513 3.4859 1.6245 5.7692 1.9569 2.5317 3.0496 1.5356 1.1730 1.3881 1.7774 1.7301 1.9454 2.4967 3.1025 4.7849 1.5550 1.3784 3.3709 4.6182 2.5168 2.7372 2.3152 1.1973 1.0483 2.5592 4.5643 7.2495 4.7224 6.8421 4.8451 10.1468 1.0377 1.0980 1.0867 1.0896 1.0886 1.0998 1.0952 1.0970 1.0960 1.0674 1.0935 1.0650
irintensity: 0.9160 6.1810 0.9873 0.1303 0.0617 0.7848 1.0530 0.0681 12.6114 3.6390 0.1961 0.5236 0.0376 1.4266 2.7785 2.8102 1.4403 13.1564 2.3493 0.0752 5.0404 11.1584 0.6548 4.7863 1.5456 0.0698 0.5869 3.9628 1.1691 13.8912 2.1904 26.8121 11.8996 331.0677 17.7904 11.7122 4.2666 7.0659 124.4799 26.9401 1.9960 43.2141 10.7259 1.8363 7.7647 54.5586 185.1978 15.6416 10.0487 81.5208 33.7222 26.4238 491.0733 0.0543 2.9993 12.6688 10.7392 66.6020 0.8939 16.0953 273.6765 48.5679 15.0455 93.9599 3.2890 1.3919 34.0204 71.5153 36.5442 21.7341 21.5390 38.0808 10.8008 104.0971 17.9652 40.5429 105.1978 265.3722 0.9073 4.5640 4.3250 1.9107 5.3756 15.3032 33.8007 29.1609 14.5885 738.7199 35.5648 23.6174
temp: 298.150 k
press: 1.00000 atm
elementType: 8 8 8 8 6 6 6 6 6 6 6 6 6 6 6 6 6 6 6 6 1 1 1 1 1 1 1 1 1 1 1 1
symmnumber: 1
zpe: 628352.0 jmol-1
zpe.correction: 0.239327 hartree
zpe.thermalcorrener: 0.255676 hartree
zpe.thermalcorrenthalpy: 0.256620 hartree
zpe.thermalcorrgfe: 0.194897 hartree
zpe.sumelectzpe: -916.436997 hartree
zpe.sumelectthermal: -916.420647 hartree
zpe.sumelectthermalent: -916.419703 hartree
zpe.sumelectthermalfe: -916.481426 hartree
dipole: -2.4581 0.3329 0.0067
dipole: 2.4806
quadrupole: -113.6150 -102.8803 -120.3215
quadrupole: 16.4333 0.0385 -0.0229
quadrupole: -1.3428 9.3920 -8.0492 16.4333 0.0385 -0.0229
hfenergy: -916.6763232 hartree
pointgroup: C01 [X(C16H12O4)]
dipole: 0.9740359 -0.059437 -0.0133849 debye
polarizability: 328.8562369|-11.8676124|231.0312303|-4.0947976|9.5468171|77.1067091 unknown
InChI: InChI=1S/C16H12O4/c1-9(17)20-13-7-3-5-11-8-10-4-2-6-12(18)14(10)16(19)15(11)13/h2-8,18-19H,1H3
charge 0 multiplicity 1
32 atoms
O  0.062201 1.883497 0.121834
O  2.455148 1.028382 0.042237
O  -2.348419 2.727447 0.205312
O  4.801563 0.786591 0.007119
C  0.591112 -0.521686 -0.02727
C  -1.764723 0.314662 0.055407
C  0.079667 -1.888916 -0.102206
C  -2.252015 -1.058133 -0.018933
C  -0.359095 0.538923 0.048798
C  -1.313794 -2.117984 -0.095806
C  2.030451 -0.354721 -0.036667
C  -2.736179 1.395009 0.132929
C  1.01616 -2.981839 -0.181555
C  -3.667693 -1.302472 -0.012661
C  2.916371 -1.423323 -0.113949
C  2.384991 -2.755536 -0.187345
C  -4.105863 1.111719 0.136334
C  -4.564835 -0.237599 0.063455
C  3.799355 1.51478 0.061936
C  3.769099 3.023244 0.159691
H  -1.680688 -3.149184 -0.152156
H  0.620365 -4.001908 -0.237658
H  -4.025598 -2.335957 -0.068721
H  3.992629 -1.257557 -0.118662
H  3.086644 -3.593494 -0.248157
H  -4.808382 1.947509 0.195754
H  -5.643616 -0.428467 0.067995
H  1.068689 1.907723 0.109272
H  -1.341708 2.771878 0.193428
H  3.257361 3.34161 1.085191
H  4.799423 3.406021 0.164579
H  3.221581 3.457774 -0.695224
