program: Gaussian 09
title: 000182660
version: EM64L-G09RevD.01
frameworkgroup: C1[X(C14H13ClO2)]
method: RPBEPBE
basis: SDD
operation: Freq
keyword: #p
keyword: freq=noraman
keyword: PBEPBE/SDD
title: #p freq=noraman PBEPBE/SDD
converged: YES YES NO NO
title: Mulliken charges:
elementType: Cl O O C C C C C C C C C C C C C C H H H H H H H H H H H H H
charge: -0.094360 -0.265113 -0.098122 0.557574 -0.304124 0.387097 0.408276 -0.569870 -0.464239 -0.416514 -0.687768 -0.433849 -0.555922 0.330164 -0.362424 -0.037833 -0.536920 0.269440 0.256428 0.235544 0.241171 0.233520 0.238328 0.229295 0.240643 0.263257 0.244177 0.247980 0.221378 0.222785
chargesum: 0.00000
title: Mulliken charges with hydrogens summed into heavy atoms:
elementType: Cl O O C C C C C C C C C C C C C C
charge: -0.094360 -0.265113 -0.098122 0.557574 -0.034684 0.387097 0.408276 -0.313442 -0.228696 -0.175343 0.013375 -0.193205 -0.292665 0.330164 -0.118247 -0.037833 0.155223
polarizability: 2.75613231e+02 1.19587749e+01 1.62561220e+02 1.39893487e+01 -1.89109896e+00 1.06717953e+02
1716.lowfreq: -9.9614 -5.5932 0.0011 0.0013 0.0027 10.4542 24.5904 26.7834 47.7331
frequency: 24.3998 26.6683 47.7321 78.5034 106.7896 133.9900 174.5528 187.7069 206.1603 212.7424 230.6299 260.5853 273.0886 315.7831 355.4799 385.0213 404.4137 410.7068 425.3561 476.1588 496.9552 517.4562 557.6688 581.0800 627.0363 671.2497 680.6429 710.8042 740.4278 778.1709 805.5943 812.0518 820.7673 888.9182 894.4596 905.1316 911.1341 947.6903 958.6849 971.5098 1001.4260 1014.0688 1067.4879 1088.1430 1112.0547 1138.0143 1141.0685 1160.7511 1174.5272 1182.8014 1235.9422 1261.2412 1275.0522 1278.8828 1304.4720 1351.6519 1392.5704 1408.5805 1412.3934 1433.1023 1439.4420 1468.6266 1469.6388 1471.9469 1472.6670 1481.5634 1511.2748 1574.3791 1609.2046 1643.5673 1736.3246 2961.5371 2997.5580 3048.4007 3050.7760 3096.1235 3109.6467 3116.5428 3123.5775 3125.7867 3129.5906 3146.9430 3153.8404 3167.8386
redmass: 8.3147 6.7156 5.7816 4.6878 4.8982 3.8000 3.1334 3.9511 3.7127 1.0456 1.5126 2.7158 3.9322 5.1074 6.1717 7.8819 3.2746 5.7802 4.7060 2.5306 4.8567 6.8147 4.9102 3.0745 6.5439 3.7809 4.9108 3.8260 5.2622 2.4064 3.5792 1.5253 1.4513 3.7905 1.7585 3.3466 1.6384 3.7894 1.4231 1.3838 4.1934 2.0322 1.6760 2.3121 1.2560 1.6010 1.6479 1.6322 1.4191 1.3494 1.5277 2.3436 1.6608 2.2579 1.3634 1.7426 1.1942 4.0133 2.8119 8.9727 1.2396 1.1271 1.0501 1.1016 1.0511 1.9745 3.9063 7.3731 5.8593 6.8977 11.2119 1.0329 1.0353 1.0847 1.1042 1.1005 1.1000 1.0917 1.0868 1.0989 1.0895 1.0977 1.0920 1.0942
irintensity: 0.7365 0.3993 1.2782 3.5905 3.0145 1.0264 2.6878 0.3068 2.0564 0.2211 1.1343 0.9096 0.7637 12.2905 3.2428 12.4800 0.5755 7.7212 12.6497 21.1034 12.7496 0.0386 13.1242 3.4699 6.2314 5.4174 4.7422 113.6946 1.3598 3.1903 1.7241 34.9964 5.3526 41.9045 59.0661 77.1395 34.3356 14.4089 3.1708 3.7995 58.9442 21.7299 9.6651 22.9304 0.2201 19.9265 45.9272 8.3383 110.1442 10.3711 21.7150 164.1406 3.2455 28.6183 2.9542 2.2441 18.2535 4.4645 1.3125 0.2100 7.7375 56.0729 12.8180 41.4448 15.8748 8.4336 71.7425 3.4307 65.3619 97.1782 232.6179 85.1820 24.7496 3.3900 47.7162 33.4510 14.2075 6.0081 4.6514 29.6514 4.7621 18.7503 6.1467 14.7960
temp: 298.150 k
press: 1.00000 atm
elementType: 17 8 8 6 6 6 6 6 6 6 6 6 6 6 6 6 6 1 1 1 1 1 1 1 1 1 1 1 1 1
symmnumber: 1
zpe: 607433.4 jmol-1
zpe.correction: 0.231359 hartree
zpe.thermalcorrener: 0.247347 hartree
zpe.thermalcorrenthalpy: 0.248291 hartree
zpe.thermalcorrgfe: 0.186130 hartree
zpe.sumelectzpe: -1150.585763 hartree
zpe.sumelectthermal: -1150.569775 hartree
zpe.sumelectthermalent: -1150.568831 hartree
zpe.sumelectthermalfe: -1150.630993 hartree
dipole: -3.3131 -0.4032 2.5076
dipole: 4.1745
quadrupole: -95.9674 -100.7476 -110.9682
quadrupole: 14.4262 14.4369 1.1306
quadrupole: 6.5937 1.8135 -8.4072 14.4262 14.4369 1.1306
hfenergy: -1150.8171225 hartree
pointgroup: C01 [X(C14H13Cl1O2)]
dipole: -1.2595439 0.0287229 -1.0536426 debye
polarizability: 275.8939636|-15.2401508|161.1951283|-5.0730086|-10.5642765|107.8033118 unknown
InChI: InChI=1S/C14H13ClO2/c1-9(14(15)16)10-3-4-12-8-13(17-2)6-5-11(12)7-10/h3-9H,1-2H3
charge 0 multiplicity 1
30 atoms
Cl 4.086218 -0.306723 2.149991
O  -4.721155 -0.289312 0.280122
O  3.965221 1.853624 0.469479
C  1.73047 -0.479924 -0.365614
C  3.242556 -0.286111 -0.574227
C  -0.555745 0.429287 -0.203334
C  -1.087946 -0.912034 -0.049466
C  0.855224 0.612158 -0.360501
C  1.20184 -1.80377 -0.201446
C  -0.168136 -2.014977 -0.053266
C  3.586442 0.273376 -1.977711
C  -1.469446 1.531111 -0.188363
C  -2.493443 -1.096898 0.107624
C  -3.359009 0.004969 0.117602
C  -2.842963 1.335716 -0.03144
C  3.767735 0.645929 0.514826
C  -5.669455 0.82714 0.322123
H  3.737148 -1.261595 -0.428916
H  1.241215 1.634143 -0.468916
H  1.891533 -2.655866 -0.190865
H  -0.558491 -3.032089 0.06724
H  3.188266 -0.408869 -2.748001
H  3.138271 1.269174 -2.130352
H  4.678808 0.362935 -2.113961
H  -1.07607 2.548425 -0.300044
H  -2.913477 -2.100917 0.226238
H  -3.515508 2.198262 -0.022408
H  -6.653413 0.357617 0.466825
H  -5.667181 1.397573 -0.626973
H  -5.455311 1.508447 1.168235
