program: Gaussian 09
title: 000182707
version: EM64L-G09RevD.01
frameworkgroup: C1[X(C21H24FN3O2)]
method: RPBEPBE
basis: SDD
operation: Freq
keyword: #p
keyword: freq=noraman
keyword: PBEPBE/SDD
title: #p freq=noraman PBEPBE/SDD
converged: YES YES NO NO
title: Mulliken charges:
elementType: F O O N N N C C C C C C C C C C C C C C C C C C C C C H H H H H H H H H H H H H H H H H H H H H H H H
charge: -0.210316 -0.306533 -0.272998 -0.427698 -0.045698 -0.546227 -0.010057 -0.437368 -0.356101 0.448561 -0.713349 -0.409741 -0.330837 0.477535 -0.608727 -0.085281 0.245336 -0.329652 -0.187006 -0.387637 0.357334 -0.505702 -0.283835 -0.368326 -0.357736 -0.337568 0.307740 0.202965 0.194488 0.202496 0.207741 0.187072 0.326770 0.211718 0.239881 0.214157 0.204660 0.206272 0.267647 0.270275 0.261569 0.263454 0.227954 0.241294 0.229902 0.234085 0.239677 0.271717 0.263333 0.255365 0.257398
chargesum: 0.00000
title: Mulliken charges with hydrogens summed into heavy atoms:
elementType: F O O N N N C C C C C C C C C C C C C C C C C C C C C
charge: -0.210316 -0.306533 -0.272998 -0.100928 -0.045698 -0.021204 0.192908 -0.040383 0.038712 0.448561 -0.047593 0.001190 -0.330837 0.477535 -0.341080 -0.085281 0.245336 -0.059378 0.040949 -0.146343 0.357334 0.197961 -0.012118 -0.104994 -0.102371 -0.080171 0.307740
polarizability: 3.52418809e+02 -5.84857660e+00 2.20739389e+02 3.44703901e+00 2.89554465e+01 2.43838160e+02
1716.lowfreq: -7.2477 -0.0007 -0.0004 0.0001 2.8832 4.9876 18.1167 20.8996 23.8249
frequency: 17.9191 20.4481 23.6792 33.2664 39.2923 56.3388 62.1334 78.6208 88.4162 94.8921 123.8111 124.9987 137.8207 150.8938 173.0120 190.4739 202.9683 205.3954 223.8531 247.5697 252.9796 262.6629 281.2625 290.3596 325.0055 349.9886 362.4564 365.8330 391.5239 399.9523 416.9091 431.7434 441.0572 471.9391 479.7479 495.0548 502.8292 520.1937 551.1528 587.5526 605.3576 607.5822 626.2326 627.6689 649.5956 658.8818 695.1854 698.1214 705.8138 733.9929 735.6215 791.6381 802.5138 803.9494 814.2492 820.1019 826.3614 836.7192 857.0479 862.7362 892.5335 925.8594 930.4946 937.5334 945.7528 958.8049 982.3201 989.5772 996.4905 1006.0972 1030.2607 1042.9341 1045.9202 1068.8002 1089.0227 1098.5446 1103.4302 1107.5241 1132.9140 1142.4608 1147.6447 1149.5823 1158.1272 1162.9249 1191.6550 1203.3442 1213.9814 1229.1517 1247.0238 1257.8176 1280.1469 1283.0567 1295.8647 1309.8036 1334.7571 1341.3170 1347.6650 1354.1259 1355.5897 1371.3307 1379.0882 1383.2231 1393.0819 1410.5673 1412.8929 1436.3911 1453.1500 1455.6522 1457.2693 1459.8203 1464.7702 1470.4818 1472.6796 1476.7763 1479.8735 1481.1011 1520.2530 1568.0075 1578.2114 1602.9381 1613.3744 1623.7312 1644.9295 2951.3809 2959.0854 2966.2436 2978.0627 2979.2966 2992.1868 3005.6216 3026.0422 3047.6678 3077.2215 3083.7205 3098.2563 3118.6585 3130.0396 3153.1097 3159.3729 3160.0259 3173.9735 3175.7162 3177.9089 3181.5542 3450.9062 3459.2106 3576.4480
redmass: 6.3231 6.1670 5.0147 3.7471 4.7643 1.8175 2.9221 3.4301 3.8737 4.2711 5.9761 4.1552 4.4235 2.3875 2.4415 4.9581 1.6474 2.7812 1.0635 4.2706 1.1014 3.7580 4.7344 4.9964 3.4091 6.2835 6.3315 5.1996 5.4503 4.2919 3.0788 4.1411 4.1808 3.7676 6.9181 2.6796 2.6332 5.1719 5.2271 4.2387 6.1736 1.5640 3.2442 2.2759 3.0641 2.3054 5.7781 4.0846 6.7101 1.1049 7.0182 2.2296 1.7436 1.2854 2.7946 1.6820 1.5894 2.3443 2.9364 2.4750 7.1720 1.4152 1.3273 1.8907 1.3324 1.3416 6.9515 1.3517 2.6899 3.4826 1.5571 2.1955 2.7780 2.9688 3.3165 1.2447 2.9155 1.2514 2.4338 1.4344 1.2689 1.7822 2.4942 1.7622 2.4071 3.5856 2.3579 1.8803 1.4101 1.3698 1.2787 1.3124 1.8168 1.3794 1.2134 1.3548 1.4728 2.1585 1.4955 2.1623 7.6598 1.2268 2.9047 3.8953 2.4151 2.2389 1.1592 1.4308 1.2218 1.1682 1.7974 1.0965 1.3048 1.0650 1.1949 2.2376 3.2790 5.9117 6.0725 7.6648 7.0216 7.6898 1.0887 1.0726 1.0662 1.0682 1.0474 1.0484 1.0289 1.0972 1.1009 1.1050 1.1000 1.0999 1.1050 1.1047 1.0887 1.0902 1.0882 1.0888 1.0991 1.0912 1.0968 1.0976 1.0446 1.0759 1.0974
irintensity: 0.1663 0.0495 0.3139 0.1107 0.3094 3.4813 6.8391 2.3415 0.9169 3.2377 1.4021 1.5507 0.4787 0.1811 0.2169 0.7509 1.1115 2.5416 1.3922 3.6062 48.9987 8.4667 6.2776 1.2179 6.3829 5.5329 0.4447 2.1524 1.1933 1.0662 0.0498 6.3983 8.4756 0.2830 9.5597 25.7585 14.5681 1.4197 3.6043 1.7201 9.7471 402.0701 6.3355 8.4677 11.9126 46.0388 13.4953 0.6842 8.0934 6.6793 43.4492 31.8416 6.7729 1.3803 1.8040 10.9457 78.7598 43.3018 7.1824 1.9547 3.2369 0.1420 0.3634 9.5227 0.2327 0.6151 135.0602 0.9373 15.3600 11.4913 0.1461 11.7753 2.0825 31.1860 31.6469 12.8577 3.8125 0.3118 22.5934 15.5275 1.7127 7.9387 223.8327 57.6524 12.3623 38.6035 230.9755 4.3841 0.9004 4.7414 0.8821 3.3804 3.9746 1.8257 8.6319 29.7887 19.3754 28.9463 9.8448 2.1726 4.0760 21.6343 14.8686 4.1824 179.0402 8.3760 66.0830 24.4426 33.0710 20.6873 65.8865 31.1050 10.2310 22.1244 22.4029 235.8529 200.3539 187.9843 76.0768 10.2028 1.5602 344.1982 32.0555 10.5268 3.1051 27.9159 14.7112 118.7351 69.5447 0.6109 4.9615 99.6746 49.3195 38.5832 27.6980 25.2370 12.5800 14.9166 6.7624 0.2432 22.8930 7.4214 2.4306 2.7026 1.4877 49.3298 0.1703
temp: 298.150 k
press: 1.00000 atm
elementType: 9 8 8 7 7 7 6 6 6 6 6 6 6 6 6 6 6 6 6 6 6 6 6 6 6 6 6 1 1 1 1 1 1 1 1 1 1 1 1 1 1 1 1 1 1 1 1 1 1 1 1
symmnumber: 1
zpe: 1077940.2 jmol-1
zpe.correction: 0.410566 hartree
zpe.thermalcorrener: 0.437116 hartree
zpe.thermalcorrenthalpy: 0.438060 hartree
zpe.thermalcorrgfe: 0.351051 hartree
zpe.sumelectzpe: -1227.179670 hartree
zpe.sumelectthermal: -1227.153120 hartree
zpe.sumelectthermalent: -1227.152176 hartree
zpe.sumelectthermalfe: -1227.239185 hartree
dipole: 0.4673 -1.7815 0.4008
dipole: 1.8849
quadrupole: -168.8853 -161.9523 -152.9755
quadrupole: 2.4918 -8.8758 6.4289
quadrupole: -7.6142 -0.6813 8.2955 2.4918 -8.8758 6.4289
hfenergy: -1227.5902359 hartree
pointgroup: C01 [X(C21H24F1N3O2)]
dipole: 0.1854183 -0.1328348 -0.7056199 debye
polarizability: 352.3572084|2.6035399|244.9602879|-5.4729038|-28.7884124|219.6788625 unknown
InChI: InChI=1S/C21H24FN3O2/c1-14(5-3-11-23)25-18-13-19(26-2)21(17-6-4-12-24-20(17)18)27-16-9-7-15(22)8-10-16/h4,6-10,12-14,25H,3,5,11,23H2,1-2H3
charge 0 multiplicity 1
51 atoms
F  -6.023245 1.330096 2.768676
O  -2.564663 -0.608433 -1.202544
O  -1.119612 1.779169 -2.329155
N  3.074699 -0.016964 -0.755637
N  1.87292 -2.230733 0.2195
N  6.142119 1.740869 3.390793
C  3.934852 1.078212 -1.228111
C  5.225989 1.117712 -0.373083
C  4.987714 1.449961 1.117332
C  1.711168 -0.101253 -0.921212
C  4.259269 0.944059 -2.739008
C  6.296482 1.436168 1.954488
C  1.061873 -1.29124 -0.380552
C  -0.368942 -1.437654 -0.486396
C  0.912416 0.860166 -1.567085
C  -1.14817 -0.413834 -1.113304
C  -0.505188 0.710011 -1.670641
C  -0.939241 -2.629582 0.069402
C  -0.107449 -3.577087 0.674576
C  1.299564 -3.340692 0.731147
C  -3.376221 -0.094735 -0.157211
C  -2.436301 1.612678 -2.975746
C  -2.87312 0.670297 0.920791
C  -4.757683 -0.382603 -0.265005
C  -3.764889 1.148595 1.906757
C  -5.65046 0.094927 0.716715
C  -5.131937 0.851219 1.783696
H  3.38806 2.031709 -1.067078
H  5.742725 0.137572 -0.462632
H  5.910674 1.867926 -0.816048
H  4.270111 0.72698 1.554883
H  4.514249 2.450509 1.202162
H  3.490719 -0.838153 -0.29997
H  4.813515 1.830035 -3.100417
H  3.336619 0.845497 -3.337702
H  4.880432 0.047838 -2.920908
H  7.014993 2.162598 1.525873
H  6.774552 0.440466 1.866214
H  1.341181 1.752504 -2.028438
H  -2.019978 -2.784435 0.003139
H  5.81955 2.694868 3.582696
H  5.590024 1.047536 3.906091
H  -0.519356 -4.496074 1.102922
H  1.971501 -4.067767 1.200767
H  -2.500797 2.456299 -3.68069
H  -2.495467 0.652405 -3.515756
H  -3.254939 1.67513 -2.239323
H  -1.803789 0.888798 0.989699
H  -5.113812 -0.976326 -1.111834
H  -3.40754 1.742129 2.753145
H  -6.722872 -0.11227 0.661129
