program: Gaussian 09
title: 000182639
version: EM64L-G09RevD.01
frameworkgroup: C1[X(C6H11IO)]
method: RPBEPBE
basis: SDD
operation: Freq
keyword: #p
keyword: freq=noraman
keyword: PBEPBE/SDD
title: #p freq=noraman PBEPBE/SDD
converged: NO YES NO NO
title: Mulliken charges:
elementType: I O C C C C C C H H H H H H H H H H H
charge: 0.000893 -0.433877 0.005036 -0.631526 -0.421937 -0.325880 -0.393181 -0.399313 0.217528 0.307766 0.216688 0.233145 0.225244 0.230402 0.214554 0.199176 0.214763 0.203786 0.336732
chargesum: 0.00000
title: Mulliken charges with hydrogens summed into heavy atoms:
elementType: I O C C C C C C
charge: 0.000893 -0.097145 0.222564 -0.323760 0.027896 0.129767 0.020549 0.019236
polarizability: 1.30693183e+02 -1.15831227e+00 7.92120638e+01 4.21809487e+00 -5.17747497e-02 6.05572893e+01
1716.lowfreq: -15.7118 -10.4246 -0.0007 -0.0006 0.0004 4.7372 93.3455 155.6748 166.8759
frequency: 93.3286 155.6693 166.8710 195.0661 300.3323 321.4564 369.2251 407.4291 410.4758 450.0587 532.2179 633.6002 783.2350 832.2624 855.4492 883.8086 931.6718 942.2686 1015.7214 1040.1542 1052.0867 1085.3186 1094.3609 1114.1309 1163.9986 1198.3337 1223.7898 1244.7959 1256.3146 1285.5200 1317.3830 1319.5783 1333.5718 1341.2318 1347.6143 1366.5497 1462.3610 1465.1299 1469.4887 1475.2991 2948.2903 2976.7106 2979.7268 2997.2311 2999.1315 3041.9568 3048.0428 3056.7907 3066.4925 3076.5987 3489.7533
redmass: 3.2362 5.3609 2.8464 5.5397 1.8412 2.2387 2.7551 1.3991 2.5331 2.9895 2.4664 2.7395 1.8668 1.8438 1.6997 2.0013 2.3986 2.0096 2.7675 1.4391 2.2744 1.5296 1.8076 1.8587 1.4003 1.5103 1.2531 1.2785 1.2661 1.2949 1.2562 1.2739 1.4173 1.4769 1.4427 1.4394 1.0873 1.0900 1.0809 1.0932 1.0836 1.0649 1.0617 1.0622 1.0627 1.0959 1.1001 1.0917 1.1022 1.0976 1.0650
irintensity: 0.5830 2.1819 0.6350 4.7780 0.4901 0.9737 37.1618 105.6293 35.4624 6.9116 8.8751 44.1597 1.9404 9.5837 11.4959 4.2774 10.5257 37.4498 66.6950 2.2174 5.7950 4.0345 13.2680 16.4309 39.0736 0.8068 29.8431 11.5501 20.3583 4.6467 6.7273 4.8718 1.2572 0.5391 29.7096 0.8076 5.5980 8.9056 24.8402 3.9952 32.7407 36.0586 34.1796 24.8364 9.2431 47.1893 49.9237 7.2960 19.4622 49.8417 6.1276
temp: 298.150 k
press: 1.00000 atm
elementType: 53 8 6 6 6 6 6 6 1 1 1 1 1 1 1 1 1 1 1
symmnumber: 1
zpe: 422388.7 jmol-1
zpe.correction: 0.160879 hartree
zpe.thermalcorrener: 0.169350 hartree
zpe.thermalcorrenthalpy: 0.170294 hartree
zpe.thermalcorrgfe: 0.126272 hartree
zpe.sumelectzpe: -321.318744 hartree
zpe.sumelectthermal: -321.310274 hartree
zpe.sumelectthermalent: -321.309330 hartree
zpe.sumelectthermalfe: -321.353352 hartree
dipole: 2.0125 -1.7616 -0.4085
dipole: 2.7056
quadrupole: -60.9013 -68.6446 -63.9123
quadrupole: -4.9056 0.0398 -1.8423
quadrupole: 3.5847 -4.1585 0.5738 -4.9056 0.0398 -1.8423
hfenergy: -321.4796238 hartree
pointgroup: C01 [X(C6H11I1O1)]
dipole: 0.9577422 -0.4421139 -0.1425778 debye
dipolederiv: -0.6945441 -0.1343667 -0.0120636 -0.1394517 -0.2555428 0.0117612 -0.1024258 -0.010397 -0.1305324 -0.4372522 0.2358981 0.1270707 0.2353264 -0.717693 0.058761 0.1348277 0.0567476 -0.4886113 0.0789961 -0.3415865 -0.0873369 -0.1258378 0.4644156 0.0425042 -0.2212343 -0.1122981 0.3581936 1.0922571 0.2484268 0.1183405 0.2851778 0.0393759 0.0224366 0.1553528 0.0633223 0.0627523 0.1099501 0.1059894 -0.0074305 -0.1345673 -0.0299669 -0.0147475 0.1194726 0.0867689 0.123573 -0.2756849 0.0123373 -0.0039555 -0.1502812 0.0085851 -0.0294771 -0.1390405 0.0343348 0.1098915 0.0484125 0.0077424 0.0231323 -0.0184475 0.0432385 0.023655 -0.0471319 0.0082458 0.1503873 0.1063714 -0.0036524 -0.0051115 0.1951193 0.0567084 0.037042 0.1234448 -0.0012284 0.1610026 0.0163267 0.0196713 -0.011598 0.0212498 -0.0086614 -0.071722 0.037824 -0.0421226 -0.1854237 -0.0854985 -0.045536 -0.0759888 -0.0317502 0.026902 -0.0480431 -0.0035534 -0.0075997 -0.0670453 0.0544841 0.0183823 0.0080481 0.0177985 0.0886767 -0.0066918 -0.024909 -0.0642389 -0.1415999 -0.01482 -0.065935 0.0156688 -0.0568777 -0.1187269 0.0753292 0.0142498 0.0920778 0.0491159 0.0469366 -0.0009146 -0.022039 0.0229491 0.0844575 0.0015174 0.0005286 -0.0558167 -0.129569 0.049389 -0.0607544 0.0229831 -0.0216012 -0.1073932 0.0707659 0.0293054 0.0888247 0.0424105 -0.1979927 -0.0696639 -0.0313253 -0.073349 0.0294947 -0.0068336 -0.0541351 -0.0135747 0.0754067 0.0908145 0.0127927 -0.0384852 0.025322 0.0206777 -0.0323627 0.0446978 -0.0122376 -0.1849924 -0.1267989 0.1100528 0.0241324 0.0962549 -0.0896016 -0.0318619 0.0487073 -0.052327 0.070932 0.0671079 -0.0285235 0.0065948 -0.0469835 0.0554982 -0.0366415 -0.0512668 0.0137767 -0.1772969 0.0715454 -0.0203601 -0.0506363 -0.1000509 0.4095557 -0.0653915 -0.064714 -0.0722579 0.3014055 unknown
polarizability: 127.0580682|12.8852043|82.65427|5.4071397|1.4350763|60.7501977 unknown
InChI: InChI=1S/C6H11IO/c7-5-3-1-2-4-6(5)8/h5-6,8H,1-4H2
charge 0 multiplicity 1
19 atoms
I  -2.830792 -1.063027 -0.122321
O  -1.228386 1.969264 0.193198
C  -0.381923 0.879785 -0.293668
C  -0.70125 -0.468343 0.379204
C  1.07172 1.283613 0.040246
C  0.263075 -1.586334 -0.04203
C  2.077947 0.185295 -0.371499
C  1.722845 -1.166332 0.290488
H  -0.490681 0.756679 -1.394288
H  -0.755935 -0.346425 1.475183
H  1.135727 1.476394 1.128945
H  1.283545 2.239729 -0.471627
H  0.168872 -1.768488 -1.129901
H  0.00299 -2.528299 0.472319
H  3.101932 0.493698 -0.08884
H  2.072738 0.066353 -1.47433
H  2.411985 -1.96207 -0.04973
H  1.842384 -1.081862 1.38953
H  -2.178194 1.723869 0.026722
