program: Gaussian 09
title: 000182638
version: EM64L-G09RevD.01
frameworkgroup: C1[X(C8H5Cl2N3S)]
method: RPBEPBE
basis: SDD
operation: Freq
keyword: #p
keyword: freq=noraman
keyword: PBEPBE/SDD
title: #p freq=noraman PBEPBE/SDD
converged: YES YES NO NO
title: Mulliken charges:
elementType: Cl Cl S N N N C C C C C C C C H H H H H
charge: -0.030471 -0.036867 0.245501 -0.088901 -0.074641 -0.573800 0.644751 -0.314044 -0.303855 -0.327733 -0.214637 -0.221494 -0.097989 -0.136392 0.300885 0.282428 0.263537 0.338731 0.344992
chargesum: 0.00000
title: Mulliken charges with hydrogens summed into heavy atoms:
elementType: Cl Cl S N N N C C C C C C C C
charge: -0.030471 -0.036867 0.245501 -0.088901 -0.074641 0.109923 0.644751 -0.314044 -0.303855 -0.026848 0.067791 0.042043 -0.097989 -0.136392
polarizability: 2.80940786e+02 -1.41418653e+00 1.44391583e+02 -7.08543251e-03 2.93064932e-02 5.22181917e+01
1716.lowfreq: -0.0017 0.0012 0.0019 2.1850 4.3601 5.8932 28.7871 57.3528 112.7931
frequency: 28.7831 57.3525 112.7931 124.6355 162.1620 187.1751 216.3286 259.2290 259.3287 314.0387 357.9679 373.9148 377.2874 439.3652 451.0852 478.5271 478.7961 537.4121 567.4822 587.5398 592.5706 595.2291 654.2110 712.5645 719.6528 776.3963 839.2767 862.6145 918.9972 966.2853 986.5797 1026.6039 1087.9629 1098.8458 1145.8706 1222.7999 1248.5583 1280.0074 1334.9756 1387.2679 1408.6261 1477.5594 1511.7722 1552.1073 1591.8501 1619.1740 3164.0976 3182.1794 3185.6075 3553.7727 3707.0407
redmass: 13.3785 7.6759 9.3337 6.7977 6.0796 21.8124 12.6845 9.1933 7.8927 1.5070 4.4278 10.9258 2.4911 9.0466 2.6130 2.0134 3.5117 4.9561 5.5128 5.7104 11.0644 8.2980 7.5164 4.1696 10.3553 9.5991 1.3872 1.4067 8.5585 2.7306 1.3422 4.4134 2.3663 5.4124 1.4188 3.1237 1.5653 2.6857 4.1850 5.4325 4.2471 3.8241 4.3164 8.8398 7.1713 1.3016 1.0888 1.0963 1.0944 1.0457 1.1041
irintensity: 5.3822 0.0757 5.0460 7.2576 0.0654 1.7159 3.0097 1.3912 0.5183 34.6322 3.6190 6.6116 26.2640 14.8811 101.0973 121.9252 66.3858 0.6102 6.3255 10.3728 6.9516 21.5189 2.0776 0.6275 5.0433 45.6129 43.8007 19.7947 30.9604 18.0390 2.1219 45.5274 50.3309 38.0993 10.5553 40.3938 0.4197 40.2888 20.2890 22.2491 10.8871 117.0806 389.9910 54.0528 35.1826 361.8825 0.8586 2.3005 1.1485 200.7386 58.7575
temp: 298.150 k
press: 1.00000 atm
elementType: 17 17 16 7 7 7 6 6 6 6 6 6 6 6 1 1 1 1 1
symmnumber: 1
zpe: 309726.7 jmol-1
zpe.correction: 0.117969 hartree
zpe.thermalcorrener: 0.130779 hartree
zpe.thermalcorrenthalpy: 0.131724 hartree
zpe.thermalcorrgfe: 0.077250 hartree
zpe.sumelectzpe: -1789.275501 hartree
zpe.sumelectthermal: -1789.262690 hartree
zpe.sumelectthermalent: -1789.261746 hartree
zpe.sumelectthermalfe: -1789.316220 hartree
dipole: -3.3518 1.7088 0.0087
dipole: 3.7623
quadrupole: -75.8146 -103.8371 -105.1633
quadrupole: -8.8463 -0.0106 -0.0081
quadrupole: 19.1237 -8.8988 -10.2250 -8.8463 -0.0106 -0.0081
hfenergy: -1789.3934695 hartree
pointgroup: C01 [X(C8H5Cl2N3S1)]
dipole: 1.2896743 -0.6437858 0.3365051 debye
dipolederiv: -0.2753426 0.1244526 -0.0633493 0.0830552 -0.5536224 0.1974575 -0.0482877 0.200286 -0.1147697 -1.0449802 0.0352206 -0.085448 0.0013397 -0.1123682 0.0215026 -0.0732748 0.0239795 -0.0687639 -0.2271695 0.1399395 -0.0761869 0.0606019 -0.3150326 0.1622766 -0.0456609 0.167958 0.0399859 0.642416 0.2757796 -0.0447948 0.1750534 -0.3986598 0.104541 -0.0046927 0.1120886 -0.1960468 -1.2535203 -0.2545641 0.019354 0.9286557 -0.342575 0.117433 -0.4253103 0.0311167 -0.2526196 -1.9283929 0.1599601 -0.1509776 0.3785029 -0.2597852 -0.1340777 -0.232249 -0.1496625 -0.6466862 0.3138384 0.1187444 -0.0280282 0.214369 -0.2531461 0.1434119 -0.0648895 0.1365262 0.035362 0.2323155 -0.1914354 0.0915427 -0.7214539 0.4273771 -0.2311755 0.2891706 -0.1922741 0.0444904 0.3017455 -0.318317 0.1464158 -0.1642396 0.7411555 -0.3199772 0.0901706 -0.331374 0.038786 -0.065512 -0.0230713 0.0116976 -0.0594241 0.0244724 -0.0534721 0.0252969 -0.0511035 -0.0873266 -0.4757364 0.1482897 -0.0860083 0.22733 -0.1906366 0.0681981 -0.1152503 0.0624871 -0.082411 -0.3456049 -0.0839341 0.0135186 -0.0902292 -0.0110619 -0.0423929 0.0153374 -0.0418035 -0.0917962 1.3821404 -0.0209991 0.1144186 -0.0690976 0.1897299 -0.1017522 0.1329758 -0.0982729 -0.0252524 1.9327478 -0.0441042 0.1488352 -0.8998047 0.501353 -0.2087661 0.4677813 -0.1466013 0.2056148 0.1104558 -0.0520019 0.0158311 -0.0213787 0.0598203 0.0342911 0.0045708 0.0322111 0.1452557 0.0775051 -0.0274133 0.0033399 -0.0413106 0.0550867 0.0400675 0.0082755 0.041152 0.1566353 0.0474928 0.0549753 -0.0290629 0.0547779 0.0281033 0.0558098 -0.0290646 0.0557717 0.1455789 0.2682435 -0.0566826 0.0114094 -0.1465689 0.2041036 0.06586 0.0443959 0.0724358 0.3830117 0.307358 0.0151611 -0.0125067 0.0898216 0.2056859 0.0807644 -0.0392949 0.0750792 0.3709516 unknown
polarizability: 279.592856|-0.648721|133.2960034|16.7702167|-30.1906295|64.661701 unknown
InChI: InChI=1S/C8H5Cl2N3S/c9-4-1-2-5(6(10)3-4)7-12-13-8(11)14-7/h1-3H,11H2
charge 0 multiplicity 1
19 atoms
Cl -0.472575 -2.509609 1.051679
Cl -5.067058 0.202214 -0.288465
S  2.230871 -1.043201 0.707504
N  1.682162 1.395169 -0.244536
N  3.066056 1.374802 -0.135213
N  4.854985 -0.054567 0.529526
C  -0.412022 0.163607 0.065431
C  1.050844 0.277409 0.127535
C  -1.207587 -0.95809 0.423466
C  -1.124186 1.312679 -0.411766
C  -2.614005 -0.961567 0.322486
C  -2.521932 1.341066 -0.523426
C  -3.254841 0.194476 -0.152322
C  3.522628 0.199111 0.337689
H  -0.526592 2.184553 -0.691809
H  -3.185568 -1.847164 0.609012
H  -3.032458 2.235002 -0.890936
H  5.193975 -0.941337 0.888678
H  5.516903 0.684044 0.29747
