program: Gaussian 09
title: 000182637
version: EM64L-G09RevD.01
frameworkgroup: C1[X(C6H7NO4S)]
method: RPBEPBE
basis: SDD
operation: Freq
keyword: #p
keyword: freq=noraman
keyword: PBEPBE/SDD
title: #p freq=noraman PBEPBE/SDD
converged: YES YES NO NO
title: Mulliken charges:
elementType: S O O O O N C C C C C C H H H H H H H
charge: 1.112939 -0.412607 -0.562474 -0.482589 -0.464053 -0.691903 0.339751 -0.500928 0.537478 -0.365702 -0.395697 -0.148486 0.261435 0.266145 0.230437 0.237325 0.315352 0.323281 0.400297
chargesum: 0.00000
title: Mulliken charges with hydrogens summed into heavy atoms:
elementType: S O O O O N C C C C C C
charge: 1.112939 -0.412607 -0.162178 -0.482589 -0.464053 -0.053270 0.339751 -0.239493 0.537478 -0.099557 -0.165260 0.088839
polarizability: 2.64901616e+02 -9.83537006e+00 1.21326872e+02 -2.92828445e+00 2.72813489e+00 7.46437201e+01
1716.lowfreq: -12.3218 -7.5648 -6.9435 0.0014 0.0017 0.0018 24.7991 28.8878 56.2912
frequency: 24.4939 28.4788 56.2648 111.2838 139.7093 165.0177 213.9039 256.0852 289.9301 298.9758 319.6108 333.7860 387.1903 393.6224 437.0528 454.6399 459.1708 507.7268 519.9018 560.2079 623.3631 664.7418 746.3416 785.8648 842.2538 862.6001 890.5567 946.4015 946.7026 972.0877 974.4135 1039.9995 1093.3892 1095.7147 1157.5578 1189.7149 1288.3019 1326.3296 1402.6430 1431.0133 1469.0860 1555.3215 1603.5961 1649.3097 3130.2268 3154.6983 3158.1525 3183.8235 3446.7969 3563.4110 3702.6326
redmass: 9.2978 6.3032 7.7020 8.4742 5.8823 6.7264 3.5962 3.6702 3.1122 4.4034 2.5741 4.2953 1.9643 1.8758 1.2331 2.9068 3.9324 6.9058 8.8068 10.8551 3.7968 1.8515 6.6555 1.4467 10.1597 2.0115 1.4904 3.3360 5.9196 1.3896 5.1392 1.5421 1.1748 1.3606 1.5377 1.7131 1.5617 2.2204 8.0586 3.0772 3.0692 5.4785 4.6467 1.2091 1.0882 1.0926 1.0927 1.0974 1.0652 1.0454 1.1041
irintensity: 0.5203 0.5474 8.3182 12.1586 21.7917 8.4987 5.0337 59.4034 15.0164 16.3342 43.4771 50.0359 82.1326 4.1827 238.8373 27.4149 11.7968 24.9737 106.2730 92.0642 10.1172 25.6622 1.7845 30.4044 76.8886 74.9746 11.1434 12.7790 67.6783 1.5543 7.0374 6.7281 155.6219 22.2511 14.5203 17.4777 52.0198 85.4523 15.8788 10.2199 48.2342 112.5394 112.7549 218.2760 8.4977 19.3523 7.9294 6.2060 84.9062 109.7434 24.9514
temp: 298.150 k
press: 1.00000 atm
elementType: 16 8 8 8 8 7 6 6 6 6 6 6 1 1 1 1 1 1 1
symmnumber: 1
zpe: 334081.7 jmol-1
zpe.correction: 0.127245 hartree
zpe.thermalcorrener: 0.140331 hartree
zpe.thermalcorrenthalpy: 0.141275 hartree
zpe.thermalcorrgfe: 0.086007 hartree
zpe.sumelectzpe: -985.458548 hartree
zpe.sumelectthermal: -985.445462 hartree
zpe.sumelectthermalent: -985.444518 hartree
zpe.sumelectthermalfe: -985.499786 hartree
dipole: 8.3983 0.6546 1.4372
dipole: 8.5455
quadrupole: -72.5359 -69.5023 -80.1420
quadrupole: 5.6028 -8.3879 1.6961
quadrupole: 1.5241 4.5577 -6.0819 5.6028 -8.3879 1.6961
hfenergy: -985.5857931 hartree
pointgroup: C01 [X(C6H7N1O4S1)]
dipole: -3.2526665 -0.1412607 0.838812 debye
dipolederiv: 1.7553396 -0.0229228 0.0163171 -0.3898941 1.2341373 0.0952618 0.2523223 -0.0785193 1.4878594 0.6723711 -0.3103996 -0.2940666 -0.3618297 -0.2774308 0.0376557 -0.4408096 0.0285431 -0.3397022 -0.9270274 0.0558289 -0.1903203 0.1947401 -0.5561588 0.0532722 -0.8685705 0.2071642 -0.7157509 -0.5383986 -0.0017452 0.0026973 0.486355 -0.664069 -0.1928102 0.3068105 -0.1122149 -0.5132409 -0.9445877 -0.0054018 0.1687256 -0.1344739 -0.4312495 0.051838 0.5381884 -0.0197935 -0.5664357 -0.647549 -0.5898064 0.0893948 -1.1153424 -0.8967296 -0.0356421 0.0665262 -0.0680119 -0.7011373 -0.35212 0.2923553 0.1750967 0.7363715 0.3235884 -0.0870088 -0.2211277 0.0432145 0.1465574 -0.1628288 -0.5588184 -0.0029246 -0.0546588 -0.221585 -0.0745599 0.0060468 -0.0694003 -0.1901811 0.1784067 0.9494046 0.0427861 1.5294553 0.8097725 0.0151261 -0.0395035 0.1800768 0.1769941 0.1975712 0.1009041 -0.031023 -0.3585133 -0.1184827 0.113667 0.1546137 -0.0018103 -0.1689841 0.2203809 0.0728716 0.0677863 -0.4347701 -0.1015192 -0.0413494 0.1039915 0.0029386 -0.1608791 0.0008763 -0.203589 0.0842304 -0.3011518 0.1511836 0.0413893 -0.0454536 -0.0158206 -0.0850552 0.0608844 0.0457588 -0.0244392 -0.0229917 -0.0062317 0.0215744 -0.0118826 -0.0138343 0.1492747 0.0489413 -0.0644174 -0.0236284 -0.0490794 0.021937 0.0014407 0.0224616 -0.011661 0.1604588 -0.1054412 0.0010541 -0.0478597 -0.0485623 0.0861045 0.0004293 -0.0330082 -0.0050811 0.1501745 0.03752 0.0825033 -0.0135477 0.1054391 -0.0609681 0.014971 -0.0357577 0.0183289 0.1504228 0.2595374 0.0496019 -0.0488953 0.0738723 0.1632122 0.007844 -0.0444598 0.0052305 0.375336 0.1026226 0.0365576 -0.0428847 0.0921932 0.2164373 -0.0001936 -0.0542894 -0.0164881 0.3732531 0.1435013 0.0702605 0.0725552 0.0528411 0.3280514 -0.0229055 0.3439016 -0.0728612 0.2710358 unknown
polarizability: 262.19494|-17.3214566|122.8402039|-15.4060012|3.7647735|75.8370642 unknown
InChI: InChI=1S/C6H6NO.HO3S/c7-5-2-1-3-6(8)4-5;1-4(2)3/h1-4H,7H2;1H
charge 0 multiplicity 1
19 atoms
S  2.583271 -0.307653 -0.629721
O  1.205912 0.430576 0.813275
O  3.700267 -0.612365 0.793585
O  2.034423 -1.712797 -1.214953
O  3.345201 0.708052 -1.623859
N  -3.04056 -1.778779 -0.055006
C  -0.11483 0.488979 0.469277
C  -0.880533 -0.706112 0.358685
C  -2.266042 -0.63179 0.068542
C  -0.714033 1.777091 0.270815
C  -2.866545 0.662196 -0.090122
C  -2.095734 1.841964 0.019035
H  -0.376593 -1.669072 0.492723
H  -0.085928 2.669553 0.339808
H  -3.939059 0.732398 -0.309152
H  -2.583558 2.813553 -0.111401
H  -4.032016 -1.721586 -0.269185
H  -2.61872 -2.70078 0.014324
H  3.117077 -0.435627 1.591531
