program: Gaussian 09
title: 000182631
version: EM64L-G09RevD.01
frameworkgroup: C1[X(C10H9ClO)]
method: RPBEPBE
basis: SDD
operation: Freq
keyword: #p
keyword: freq=noraman
keyword: PBEPBE/SDD
title: #p freq=noraman PBEPBE/SDD
converged: NO YES NO NO
title: Mulliken charges:
elementType: Cl O C C C C C C C C C C H H H H H H H H H
charge: -0.059637 -0.269040 0.309813 0.176042 0.201239 0.211024 -0.330342 -0.803111 -0.363620 -0.796233 -0.268701 -0.206533 0.224899 0.247166 0.247165 0.254970 0.256212 0.242682 0.242657 0.249891 0.233458
chargesum: 0.00000
title: Mulliken charges with hydrogens summed into heavy atoms:
elementType: Cl O C C C C C C C C C C
charge: -0.059637 -0.269040 0.309813 0.176042 0.201239 0.211024 -0.330342 -0.083881 -0.108650 -0.054682 -0.018810 0.026925
polarizability: 1.58952793e+02 -6.92856179e+00 1.40350849e+02 1.18999102e-02 7.66127911e-03 5.62219807e+01
1716.lowfreq: -94.9096 -10.9328 -7.2518 -0.0021 -0.0019 -0.0006 4.6301 89.8184 130.2535
frequency: -94.8940 89.8097 130.2527 151.9169 165.3791 205.7286 249.1461 291.3333 299.0293 328.2824 368.3850 499.0844 511.1450 534.7872 562.5627 571.6084 617.6924 660.0191 728.0538 735.1981 772.4684 849.5324 885.0606 891.5020 942.9335 953.9924 1033.7131 1037.0657 1046.6523 1074.8476 1117.6166 1140.1476 1170.7389 1228.8524 1239.2119 1347.7967 1390.6327 1405.2538 1411.5370 1425.4230 1460.5488 1461.6130 1465.0238 1472.7103 1478.4766 1574.4734 1616.1929 1631.2482 2985.5008 2986.2067 3062.4561 3068.2355 3085.3898 3105.8140 3149.0555 3169.0266 3182.3766
redmass: 1.0194 4.2462 3.4838 1.0431 7.0203 4.1125 2.5403 4.1585 5.0826 4.2016 9.0297 5.9934 4.5376 4.1279 5.5555 4.6173 4.3902 5.9512 5.6105 2.6919 1.7289 3.6845 1.3647 7.3329 1.8520 1.3144 1.3872 2.2961 1.4970 2.0362 2.5587 2.0438 1.6580 2.1534 3.4373 3.1783 2.6010 1.4586 1.2856 4.3801 1.0442 2.8502 1.0936 1.0441 1.1519 7.4366 8.7871 8.1941 1.0369 1.0373 1.0984 1.0981 1.0994 1.0976 1.0870 1.0930 1.0989
irintensity: 0.0467 0.5086 4.9523 0.6739 2.0236 2.8695 0.4915 0.6618 0.0099 0.1686 7.2561 2.7538 0.1118 1.8045 1.8530 0.7585 0.1719 0.0186 12.7559 33.3897 55.8803 10.1565 0.1512 65.8006 3.1796 2.0884 5.8747 9.3217 0.0955 16.3169 0.8333 39.1120 40.1530 16.3990 6.1528 5.5514 25.8175 36.5894 16.5755 30.5674 30.5914 13.7720 4.7540 0.2322 20.5260 28.2531 9.1558 16.0429 13.8155 36.2170 14.7486 13.6024 19.3640 6.7299 4.0684 3.7503 9.2002
temp: 298.150 k
press: 1.00000 atm
elementType: 17 8 6 6 6 6 6 6 6 6 6 6 1 1 1 1 1 1 1 1 1
symmnumber: 1
zpe: 418805.1 jmol-1
zpe.correction: 0.159514 hartree
zpe.thermalcorrener: 0.169781 hartree
zpe.thermalcorrenthalpy: 0.170726 hartree
zpe.thermalcorrgfe: 0.123568 hartree
zpe.sumelectzpe: -920.893908 hartree
zpe.sumelectthermal: -920.883641 hartree
zpe.sumelectthermalent: -920.882697 hartree
zpe.sumelectthermalfe: -920.929854 hartree
dipole: 1.5694 0.2154 0.0004
dipole: 1.5841
quadrupole: -68.3096 -72.3726 -80.0538
quadrupole: -7.8367 0.0005 -0.0001
quadrupole: 5.2691 1.2061 -6.4751 -7.8367 0.0005 -0.0001
hfenergy: -921.0534221 hartree
pointgroup: C01 [X(C10H9Cl1O1)]
dipole: -0.5675706 -0.2574382 0.0001433 debye
dipolederiv: -0.1686423 -0.0761027 0.0000199 -0.1623378 -0.7797785 0.0001081 0.0000193 0.0000997 -0.0654727 -0.8068793 0.1568853 0.0000032 -0.0924202 -0.6414326 0.0000755 0.0000693 0.0000846 -0.141069 0.230806 -0.0024189 -0.0000178 -0.3939853 -0.4649278 0.0000924 0.0000665 0.0000669 0.0260289 -0.2968453 -0.1706819 0.0000244 -0.1852386 0.1404773 0.0000051 0.0000475 0.0000717 -0.0969348 0.4341408 -0.0503942 0.0000011 0.4889312 0.130206 -0.0000373 -0.0000738 -0.0000073 0.0626192 0.5862666 -0.0231126 -0.0000436 0.035101 0.5067104 -0.0000923 -0.0003464 -0.0001939 -0.0155963 0.2335423 0.0902686 -0.0000329 0.2593493 1.1481511 -0.0001768 -0.0000631 -0.00016 -0.0729689 0.0371909 0.0133131 0.0000112 0.0226896 -0.0471641 0.0000343 -0.0000135 -0.0000345 0.0765675 -0.004192 -0.0253861 -0.0000157 -0.04109 0.0082244 -0.0000218 -0.0000051 -0.0000287 -0.1700052 -0.1898908 -0.0198702 -0.0000485 0.0440128 0.0197317 -0.0000279 0.000283 0.0000517 0.0754336 -0.0753221 0.0585489 -0.000007 0.0691003 -0.2946536 0.0000113 -0.0000113 0.0000171 -0.1315908 -0.0525491 0.0492106 -0.000003 -0.0343858 0.098272 -0.0000303 -0.0000068 -0.00004 -0.1793192 -0.1660287 0.0593885 -0.0001052 -0.0288608 0.0864317 -0.0000259 -0.0000847 0.0000339 0.1055968 0.0965186 -0.03594 -0.0727278 0.0096135 -0.004027 -0.064733 -0.0394964 -0.097169 -0.03281 0.0964942 -0.0360516 0.0728292 0.00955 -0.0039667 0.0647201 0.0395943 0.0971162 -0.0326766 0.0963547 -0.0274601 0.0000086 0.0014577 -0.0537861 0.0000315 0.0000067 0.0000341 0.1840342 0.0983467 0.0025964 0.0000165 -0.0803011 -0.0761071 -0.0001746 -0.0000981 -0.000174 0.1311563 -0.0346326 0.0002562 0.0452984 0.0332989 0.0741402 -0.0901352 0.1037417 -0.0613472 -0.029962 -0.0344854 0.0004229 -0.0452271 0.0335778 0.0738699 0.0903426 -0.1036504 0.0615461 -0.0296245 -0.0291439 -0.0569702 0.0000176 -0.0711615 0.0665714 0.0000189 0.0000194 0.0000164 0.1703292 -0.0510492 0.0934978 -0.0000014 0.0830991 0.0130573 0.0000154 0.0000019 0.0000164 0.1662642 unknown
polarizability: 161.2279274|-0.7119044|138.0757141|-0.0092186|-0.0107388|56.2219807 unknown
InChI: InChI=1S/C10H9ClO/c1-6-7(2)12-9-5-3-4-8(11)10(6)9/h3-5H,1-2H3
charge 0 multiplicity 1
21 atoms
Cl 1.655925 2.698059 -0.000362
O  -1.213132 -1.560457 0.000388
C  0.173334 0.293552 0.000049
C  -1.210401 0.762773 0.000067
C  0.12611 -1.134963 0.000252
C  -2.007152 -0.370847 0.000283
C  1.460592 0.87952 -0.000112
C  -1.713669 2.183607 -0.000067
C  1.248543 -1.973643 0.000288
C  -3.488462 -0.58776 0.00048
C  2.619048 0.082333 -0.000058
C  2.509482 -1.336084 0.000145
H  -2.817351 2.208649 -0.000499
H  -1.358199 2.737668 0.887194
H  -1.357467 2.737754 -0.88697
H  1.147152 -3.061931 0.000437
H  -3.705638 -1.668219 -0.000376
H  -3.964652 -0.141843 0.892822
H  -3.965064 -0.140321 -0.890872
H  3.60425 0.557841 -0.000171
H  3.423655 -1.937985 0.000181
