program: Gaussian 09
title: 000182625
version: EM64L-G09RevD.01
frameworkgroup: C1[X(C3H10O7P2)]
method: RPBEPBE
basis: SDD
operation: Freq
keyword: #p
keyword: freq=noraman
keyword: PBEPBE/SDD
title: #p freq=noraman PBEPBE/SDD
converged: YES YES NO NO
title: Mulliken charges:
elementType: P P O O O O O O O C C C H H H H H H H H H H
charge: 1.267384 1.317480 -0.386432 -0.774448 -0.667700 -0.677690 -0.738539 -0.595407 -0.569984 -0.498467 -0.346708 -0.684969 0.278649 0.227955 0.251534 0.251191 0.221973 0.430322 0.421278 0.402127 0.451128 0.419321
chargesum: 0.00000
title: Mulliken charges with hydrogens summed into heavy atoms:
elementType: P P O O O O O O O C C C
charge: 1.267384 1.317480 0.043890 -0.353169 -0.265573 -0.226561 -0.319218 -0.595407 -0.569984 -0.498467 0.159896 0.039728
polarizability: 1.20760460e+02 -1.91990365e-01 1.03960152e+02 -2.18112320e-01 -2.18972638e+00 9.14959864e+01
1716.lowfreq: -10.3935 -3.2902 -0.0026 -0.0024 -0.0008 16.9209 23.3945 54.0577 89.7982
frequency: 19.3614 53.9755 89.7748 118.7752 133.1437 154.7830 162.3033 180.4831 196.7895 209.5053 236.1186 246.9403 259.6304 284.5999 298.7527 302.7697 336.7582 342.9425 349.8628 375.3377 396.0786 407.0579 441.0714 525.7434 611.7458 634.0702 657.5738 696.3842 723.6825 752.0448 775.7071 803.6413 896.2814 959.2311 966.5720 984.4485 991.4754 1052.7760 1069.9217 1078.1012 1114.9457 1143.9413 1275.6640 1286.7637 1325.6623 1378.4727 1402.7659 1457.4769 1477.7153 1493.1284 2997.1925 2999.5596 3020.4326 3053.0516 3092.8893 3113.4641 3349.1485 3589.8684 3611.1403 3642.9874
redmass: 5.8716 5.2338 1.8128 2.3978 4.0653 4.2714 4.7994 2.7082 6.2707 4.6818 1.5828 3.2632 3.0711 4.5820 3.3392 3.7614 4.7079 4.9775 3.5976 1.1634 6.2589 4.9757 6.5548 3.6132 1.3283 7.9229 9.4901 2.6574 4.3716 1.9876 2.6602 1.4526 3.4949 1.5240 1.9710 1.3995 1.2607 5.5303 3.7989 2.8887 2.0466 2.2550 1.1207 1.1291 1.3015 1.3152 1.1910 1.0782 1.0387 1.0530 1.0581 1.0392 1.0685 1.1008 1.1000 1.1003 1.0651 1.0663 1.0665 1.0668
irintensity: 8.8338 10.0606 70.7240 0.7073 15.0205 4.9604 4.9062 11.0385 2.7637 7.6588 8.2740 9.8013 29.0983 22.9278 36.0137 30.4087 18.2941 11.5440 32.8341 194.7367 95.6892 2.9451 17.7520 23.1732 148.4084 87.4305 93.6657 68.2651 78.4165 211.7789 202.7241 23.2543 32.9563 118.6904 70.3087 3.1990 52.4912 105.9667 88.5141 44.2155 16.1625 45.9290 128.8568 119.0111 10.5237 100.1371 39.5991 11.9351 14.9214 12.4704 12.4027 15.9007 506.7406 3.3471 18.4173 13.3988 143.2977 75.0384 71.9112 99.4487
temp: 298.150 k
press: 1.00000 atm
elementType: 15 15 8 8 8 8 8 8 8 6 6 6 1 1 1 1 1 1 1 1 1 1
symmnumber: 1
zpe: 392390.0 jmol-1
zpe.correction: 0.149453 hartree
zpe.thermalcorrener: 0.165697 hartree
zpe.thermalcorrenthalpy: 0.166641 hartree
zpe.thermalcorrgfe: 0.106187 hartree
zpe.sumelectzpe: -1328.335563 hartree
zpe.sumelectthermal: -1328.319320 hartree
zpe.sumelectthermalent: -1328.318376 hartree
zpe.sumelectthermalfe: -1328.378829 hartree
dipole: 2.4417 -3.4140 0.6532
dipole: 4.2478
quadrupole: -100.9638 -80.6377 -81.0182
quadrupole: -0.3852 -8.9939 -2.3375
quadrupole: -13.4239 6.9022 6.5217 -0.3852 -8.9939 -2.3375
hfenergy: -1328.4850166 hartree
pointgroup: C01 [X(C3H10O7P2)]
dipole: 0.8754322 1.4199597 0.1016336 debye
dipolederiv: 1.2515904 -0.1686771 -0.1990224 0.2709262 1.647079 -0.1044037 -0.1327396 -0.1293373 1.5429458 1.655917 0.093536 0.1205219 -0.1189121 1.4844142 -0.0639079 0.1734976 -0.1162231 1.470451 -0.5511851 -0.0425459 -0.0119661 -0.0380073 -0.3850793 0.0139152 -0.1189393 -0.1345997 -0.9848239 -0.7102617 -0.0160309 0.1769246 0.0286808 -0.7756442 -0.1877253 0.1248211 -0.2269949 -1.081722 -0.4204288 0.0561312 -0.0248693 -0.0678641 -1.0884242 0.2392352 0.0941838 0.3042854 -0.7127351 -0.8133573 -0.1083187 -0.015938 -0.0712068 -0.8717897 -0.2782188 -0.0453218 -0.1920422 -0.8129798 -0.8224817 0.0167615 -0.2526952 0.0729627 -0.7131989 0.2658169 -0.3255693 0.2717645 -0.8767276 -0.8247406 0.0227716 -0.02143 -0.1852019 -0.6941395 -0.0349269 -0.0802881 0.0030227 -0.5445389 -0.8105084 -0.0833685 0.0386075 -0.0056508 -0.6107548 0.0493248 0.043996 0.0265876 -0.5332691 0.1146444 0.1215625 0.1092815 0.1368936 0.3405528 0.1727574 0.2515392 0.2697841 0.5929674 -0.1376776 -0.0807378 -0.0064894 -0.051674 -0.0673766 0.0608005 0.0474841 -0.1019488 0.0620228 -0.0034232 0.0419058 0.025927 0.0792256 -0.006587 -0.0226756 -0.0147033 0.0425296 0.022324 0.0079524 -0.0380714 -0.0135975 -0.0540907 0.0193564 -0.0089694 -0.0182513 0.0061928 0.0964133 0.0722789 0.0366963 -0.0011921 0.0217767 0.0736919 -0.0785328 0.0124923 -0.0395985 -0.0980798 -0.0118274 -0.0608256 -0.0143026 -0.1264731 0.0625301 -0.0264488 -0.0333597 -0.032616 0.079885 0.0888507 -0.012791 -0.0291052 -0.0016222 0.1179547 0.0038688 0.01597 -0.0517302 -0.0923277 0.0606326 0.0467943 0.0075711 0.0807531 -0.1392407 0.070291 0.0017424 0.0861876 0.0723055 0.4927394 0.0268976 0.0104582 0.0415011 0.2209893 -0.0262424 -0.0212387 0.0189502 0.4173973 0.1525688 -0.0188263 -0.0287353 -0.022618 0.3875813 -0.0224682 -0.0477856 -0.0373726 0.3277982 0.1796048 -0.0504597 -0.0372858 -0.0719288 0.3266056 -0.011187 -0.0382978 0.0129168 0.3750992 0.7082698 0.1502834 0.0663946 0.0106184 0.3501315 0.0156939 0.0311929 0.0503479 0.361711 0.3208426 0.0673128 0.1009425 0.0719116 0.3213481 -0.025997 0.0795751 -0.0301058 0.3158836 unknown
polarizability: 120.6525106|1.0811514|104.3303224|1.0205067|1.0514312|91.2337652 unknown
InChI: InChI=1S/C3H10O7P2/c1-2-3(4,11(5,6)7)12(8,9)10/h4-6,8-9H,2H2,1H3
charge 0 multiplicity 1
22 atoms
P  1.300792 0.850269 0.410801
P  -1.834369 -0.041404 0.332912
O  0.058984 -0.52508 -1.620646
O  0.564189 1.323783 1.960502
O  0.877468 2.154958 -0.637261
O  -1.926368 1.30898 1.373696
O  -2.207257 0.681011 -1.210742
O  2.865945 0.616611 0.595313
O  -2.719311 -1.292563 0.740535
C  0.016013 -0.49182 -0.199363
C  0.391398 -1.864104 0.384328
C  1.681208 -2.455649 -0.223576
H  -0.467832 -2.533524 0.19161
H  0.481114 -1.779235 1.485136
H  2.566385 -1.836344 0.005026
H  1.589545 -2.541637 -1.318305
H  1.8523 -3.463799 0.192651
H  -0.577855 0.160993 -1.984824
H  1.208033 1.554772 2.675102
H  1.609565 2.793946 -0.832656
H  -1.039997 1.499798 1.846787
H  -2.905648 1.37884 -1.209324
