program: Gaussian 09
title: 000182621
version: EM64L-G09RevD.01
frameworkgroup: C1[X(C6H11NO4)]
method: RPBEPBE
basis: SDD
operation: Freq
keyword: #p
keyword: freq=noraman
keyword: PBEPBE/SDD
title: #p freq=noraman PBEPBE/SDD
converged: YES YES NO NO
title: Mulliken charges:
elementType: O O O O N C C C C C C H H H H H H H H H H H
charge: -0.276598 -0.202319 -0.196679 -0.264733 0.144935 0.319974 -0.428510 -0.703729 -0.704350 0.336251 -0.758287 0.256091 0.301423 0.233532 0.214995 0.251780 0.266152 0.236657 0.218922 0.266047 0.245539 0.242907
chargesum: 0.00000
title: Mulliken charges with hydrogens summed into heavy atoms:
elementType: O O O O N C C C C C C
charge: -0.276598 -0.202319 -0.196679 -0.264733 0.144935 0.319974 0.129004 -0.003423 0.017380 0.336251 -0.003794
polarizability: 9.94212179e+01 -9.57304359e+00 8.56855372e+01 -2.45399250e+00 -2.95618178e+00 7.37381880e+01
1716.lowfreq: -5.0661 0.0005 0.0007 0.0008 7.1836 16.8249 41.9111 60.9900 62.4456
frequency: 41.7512 60.9529 62.3154 90.9253 141.5244 167.0356 188.8867 195.6179 239.1686 274.3209 301.6945 318.7687 378.6451 431.0614 442.9120 477.9244 565.5452 582.4136 613.4118 687.9306 746.2615 829.1932 860.8042 895.7067 905.9404 943.3245 991.5416 999.1805 1020.0208 1042.4693 1122.7225 1179.9981 1195.2080 1215.7075 1242.4597 1273.5535 1319.5051 1380.5696 1381.8426 1404.4068 1420.7361 1442.2616 1451.0671 1452.5419 1455.1068 1468.1582 1473.5809 1493.8691 1646.4232 2997.5725 3004.4952 3006.0873 3054.4595 3092.7446 3099.4719 3106.1292 3111.6302 3118.9894 3138.6612 3142.6804
redmass: 5.9811 4.3377 1.2698 3.8624 3.7384 4.1859 3.8640 1.1102 1.1005 3.7088 3.5810 3.0803 3.4438 3.1576 2.6863 2.4415 3.5244 4.7341 4.2400 7.4929 5.7059 3.3383 6.4742 3.2401 2.2530 1.5658 1.7439 1.7880 1.4321 1.6653 1.6265 2.1452 2.9418 3.6980 3.2845 2.7382 1.4920 1.2078 1.2304 1.2103 3.8717 1.1050 1.0719 1.0572 1.0665 1.0645 1.0517 1.0594 8.9741 1.0362 1.0360 1.0379 1.0567 1.0990 1.0947 1.0997 1.1007 1.1007 1.1088 1.1022
irintensity: 2.2004 1.2579 1.5237 5.9182 0.6712 3.2500 4.7636 0.4941 0.2896 3.6997 2.1504 2.7912 2.5708 2.9123 2.6664 3.7662 3.1131 17.9522 8.9258 3.4489 12.3855 2.6697 8.0237 45.3520 13.4796 6.8013 29.3466 41.2198 1.7758 12.1124 30.5137 210.9283 155.6902 143.0174 30.6290 19.0851 12.6217 23.6270 76.6538 24.1599 103.7018 28.2953 32.7746 26.1239 2.2435 12.5911 1.8266 32.7088 161.4304 13.5956 11.8548 0.8262 7.0781 12.0252 6.4213 24.9706 14.4574 8.3545 2.5305 8.7880
temp: 298.150 k
press: 1.00000 atm
elementType: 8 8 8 8 7 6 6 6 6 6 6 1 1 1 1 1 1 1 1 1 1 1
symmnumber: 1
zpe: 450931.7 jmol-1
zpe.correction: 0.171751 hartree
zpe.thermalcorrener: 0.184446 hartree
zpe.thermalcorrenthalpy: 0.185390 hartree
zpe.thermalcorrgfe: 0.132294 hartree
zpe.sumelectzpe: -589.931745 hartree
zpe.sumelectthermal: -589.919050 hartree
zpe.sumelectthermalent: -589.918106 hartree
zpe.sumelectthermalfe: -589.971202 hartree
dipole: 1.1130 3.5003 0.4350
dipole: 3.6986
quadrupole: -69.4723 -65.3445 -65.7518
quadrupole: -7.3147 7.3121 -0.7227
quadrupole: -2.6161 1.5117 1.1044 -7.3147 7.3121 -0.7227
hfenergy: -590.103496 hartree
pointgroup: C01 [X(C6H11N1O4)]
dipole: 0.5882565 1.3265503 0.1080646 debye
dipolederiv: -1.1468138 0.571851 0.1298672 0.6252569 -0.8533108 -0.105171 0.1821124 -0.1764302 -0.5404759 -0.8117359 0.1515849 0.0272539 -0.0052059 -0.4225774 0.0627832 0.1950922 0.0716766 -0.25262 -0.5464127 0.0859092 0.0644252 0.2501848 -0.6148803 0.0544575 0.0274742 0.1862911 -0.2236881 -0.5888841 0.1637668 -0.0008259 0.1653164 -0.4695897 0.0851936 0.232634 -0.1074382 -0.9258998 1.1578819 -0.2213077 -0.1688643 -0.1444793 0.8731283 -0.1906302 -0.3650579 -0.40267 0.1867133 0.8022752 -0.1229512 0.0185739 -0.1578 0.6556416 0.0525956 0.3022873 0.0617121 0.2816571 -0.1571975 -0.0759981 0.0273642 -0.1128604 -0.1185433 -0.0224161 -0.0040607 0.0167113 0.0530689 -0.0607078 0.0255124 0.0564782 0.0126044 -0.0299016 -0.0248756 0.0593284 -0.0377334 -0.078967 -0.106956 -0.0544001 0.0763853 -0.022203 -0.1171239 0.0540242 -0.0400842 -0.0090902 -0.0547414 1.1458019 -0.7004421 -0.0795348 -0.7646215 0.8764877 -0.081121 -0.4390679 0.2176895 1.1917849 -0.0851267 0.1059438 -0.0672911 0.1918749 -0.2054007 0.18359 -0.1355495 0.1705241 -0.1690177 -0.0229217 0.0518392 -0.0522457 0.0115325 0.0389181 0.0619204 0.0094604 0.0693447 0.0973921 0.1913719 0.0118751 0.0825498 -0.0158719 0.0127821 -0.0409558 0.0548931 0.004886 0.067675 0.0303562 -0.0969261 -0.0839686 -0.068471 0.0195703 -0.0841349 -0.0503921 -0.0846916 0.0290856 -0.029318 0.1048204 -0.04106 0.0924959 0.0361529 0.0319893 -0.0747854 0.0607624 0.0396466 0.0665619 -0.0421676 0.0548451 -0.0569782 -0.0124691 0.0950337 0.0493787 0.0695268 0.04232 0.0681904 0.00164 0.0772609 0.0275689 0.1121581 -0.0751551 0.0765077 -0.0314486 -0.0045372 0.0183165 -0.0953507 -0.059889 -0.0897217 0.029421 -0.0295438 -0.0829779 -0.0658965 0.0046935 -0.0272245 0.1200322 -0.065464 0.096297 -0.013716 0.055328 -0.0477203 0.0616381 0.091321 0.0465924 -0.0878001 0.0089297 -0.0634294 0.0371911 0.0354607 0.0130315 0.0174214 0.1220534 0.0964468 0.0204685 -0.043651 -0.0293304 0.0654267 -0.1061031 -0.043651 -0.073596 -0.0084152 -0.0404964 0.0821001 0.0388608 0.0578412 0.1006349 -0.0122694 0.0811469 -0.0191893 0.050951 unknown
polarizability: 97.1885249|-10.9219835|87.6483199|-1.5133651|-3.7764247|74.0080983 unknown
InChI: InChI=1S/C6H11NO4/c1-5(8)11-6(2,3)4-7(9)10/h4H2,1-3H3
charge 0 multiplicity 1
22 atoms
O  0.904229 0.273776 0.747016
O  -2.922978 -0.656936 0.040285
O  -1.013116 -1.908218 0.030227
O  1.949489 -0.451384 -1.224546
N  -1.682295 -0.845435 -0.254134
C  -0.109063 1.136604 0.037403
C  -0.944335 0.275292 -0.957824
C  -0.96037 1.69341 1.189331
C  0.594039 2.26111 -0.752733
C  1.831044 -0.492415 0.021399
C  2.615687 -1.373207 0.963533
H  -1.709956 0.908691 -1.430584
H  -0.280798 -0.187378 -1.703971
H  -0.334774 2.332891 1.834041
H  -1.795928 2.296397 0.793399
H  -1.377862 0.883011 1.808895
H  1.167631 1.864059 -1.604666
H  1.284669 2.799192 -0.080816
H  -0.154573 2.984445 -1.123345
H  1.99169 -2.246739 1.227854
H  2.85721 -0.839974 1.896699
H  3.532264 -1.726592 0.468936
