program: Gaussian 09
title: 000182680
version: EM64L-G09RevD.01
frameworkgroup: C1[X(C22H28NO4)]
method: RPBEPBE
basis: SDD
operation: Freq
keyword: #p
keyword: freq=noraman
keyword: PBEPBE/SDD
title: #p freq=noraman PBEPBE/SDD
converged: YES YES NO NO
title: Mulliken charges:
elementType: O O O O N C C C C C C C C C C C C C C C C C C C C C C H H H H H H H H H H H H H H H H H H H H H H H H H H H H
charge: -0.301262 -0.266953 -0.275482 -0.278068 -0.110356 -0.179793 -0.410817 0.038183 -0.681958 -0.567145 0.384729 -0.565392 -0.611356 0.172404 0.457876 0.002218 -0.569741 0.062457 0.185026 -0.522044 0.110642 0.217875 -0.360478 -0.523181 -0.495360 -0.486080 -0.532332 0.283418 0.285872 0.267225 0.249546 0.230628 0.271955 0.253159 0.262823 0.262530 0.267169 0.300545 0.274029 0.261731 0.273615 0.245235 0.256110 0.227263 0.245331 0.247119 0.249347 0.222984 0.242947 0.220253 0.254998 0.232045 0.256529 0.230090 0.231892
chargesum: 1.00000
title: Mulliken charges with hydrogens summed into heavy atoms:
elementType: O O O O N C C C C C C C C C C C C C C C C C C C C C C
charge: -0.301262 -0.266953 -0.275482 -0.278068 -0.110356 0.103625 0.142281 0.038183 -0.201784 -0.042031 0.384729 0.227130 0.224949 0.172404 0.457876 0.002218 -0.296126 0.062457 0.185026 -0.276809 0.110642 0.217875 -0.104369 0.196533 0.219918 0.221217 0.186178
polarizability: 3.36317683e+02 5.12706516e+00 3.05875985e+02 -3.57967619e+00 -1.18990303e+01 1.67569454e+02
1716.lowfreq: -64.7284 -0.0008 0.0001 0.0004 2.2078 9.4674 10.2572 33.1032 39.0937
frequency: -64.7265 33.0345 39.0622 49.1404 60.6882 66.8080 82.6094 99.1867 104.0540 108.9269 126.9033 142.0505 153.9949 181.3788 187.8402 195.6878 201.8487 220.8964 224.9876 241.3864 251.1317 257.8558 262.9343 284.5393 289.0807 291.5027 309.6395 332.3973 337.7475 353.4706 361.7873 383.2096 397.6717 415.7031 424.4164 451.8929 472.1306 481.9484 503.9596 517.0545 524.3528 538.1977 559.8017 573.5597 626.3326 642.7871 647.0863 668.6099 698.5747 718.3464 735.5922 747.8264 753.8768 767.9040 789.7542 803.2425 848.5386 872.8008 878.6479 899.5802 908.5802 918.5579 925.9900 935.9976 953.4778 981.3230 989.4506 1018.0995 1032.2121 1051.8040 1063.0203 1074.1556 1095.0238 1103.7488 1106.0592 1107.1697 1110.5125 1114.2797 1126.4678 1141.1026 1144.5224 1147.7340 1152.5497 1167.8149 1174.3552 1188.7940 1196.4965 1202.2675 1220.9436 1227.6498 1233.2066 1244.7592 1263.4541 1273.3686 1299.5066 1303.6137 1312.1322 1335.4714 1343.1922 1367.7889 1374.1747 1385.8411 1394.2706 1410.7402 1422.7664 1426.1855 1437.3620 1443.4175 1444.0850 1447.7379 1450.4100 1454.4451 1455.0234 1456.1274 1459.3492 1460.8760 1462.2480 1463.5283 1466.4976 1470.0093 1470.2755 1474.6845 1475.1052 1479.9560 1481.2171 1484.3250 1501.0540 1573.8178 1575.8646 1592.7566 1602.3658 2966.0213 2973.2072 2980.1190 2983.8842 2987.0924 2999.1134 3002.9145 3021.3652 3027.3938 3032.1292 3042.1759 3058.6120 3067.4348 3079.3663 3095.3352 3111.3312 3114.7079 3122.0820 3137.2128 3137.7305 3138.5327 3139.7545 3141.1316 3141.6863 3153.7622 3153.9362 3159.2889 3174.1589
redmass: 1.5840 1.8200 3.6095 3.8328 2.7749 3.1704 1.4375 2.6715 3.4110 2.5964 2.1433 1.7796 3.1069 2.4854 3.8201 2.4765 1.3784 4.0368 3.5668 1.2480 2.5176 2.2211 2.7177 3.2343 3.5478 3.0191 1.4861 3.3932 4.8621 3.9859 3.8261 3.8979 4.1521 3.3089 4.8109 3.9244 3.5764 4.5237 4.0366 4.7176 3.7652 4.1424 3.3549 4.2504 5.1041 5.1555 5.2899 4.7099 5.1121 3.7728 4.6058 5.9633 4.5404 5.2914 3.1631 1.4864 5.0856 1.6988 3.1325 2.7007 5.9411 1.4965 3.1389 3.3716 3.0607 3.2002 3.2374 2.7234 2.9061 2.9392 3.4641 2.3487 1.2994 1.2488 1.2324 1.2826 1.2569 2.4628 1.6007 1.4440 1.4402 1.4452 1.4896 1.9130 1.3782 1.4279 1.8436 1.5467 1.8049 1.3245 3.3116 1.8582 2.5543 1.6905 1.8714 2.3735 1.9106 1.5827 1.9851 5.5057 1.4391 3.3097 2.6360 2.0405 1.2041 1.4759 1.2581 1.3123 1.1559 1.3028 1.4995 1.0965 1.1076 1.2533 1.4193 1.0769 1.0999 1.1045 1.0915 1.2237 1.0835 1.0681 1.0576 1.1666 1.7533 1.0743 1.0613 6.9142 7.6472 7.0998 7.7493 1.0822 1.0325 1.0306 1.0632 1.0647 1.0315 1.0302 1.0604 1.0344 1.0339 1.0938 1.0994 1.1048 1.1044 1.1080 1.1010 1.1025 1.1026 1.0965 1.1045 1.0940 1.1061 1.1060 1.1042 1.0923 1.1034 1.1046 1.0939
irintensity: 5.7112 4.8547 0.1650 3.9905 0.2054 0.6219 4.9080 1.1317 3.5111 8.5149 2.0701 5.6714 2.1765 0.3697 1.9503 2.4706 1.7837 3.2236 3.6649 0.2693 2.8549 2.5425 3.3962 4.1961 2.2463 1.2702 0.2682 4.4796 1.6359 9.9968 4.8171 2.0622 0.7229 1.2858 4.5724 5.3978 2.7373 4.1856 0.4290 1.1261 1.4392 4.4785 1.6759 7.5288 2.7536 3.1993 5.3445 4.6879 6.0175 2.4417 10.9219 5.2654 1.1638 1.5687 32.1233 37.1160 38.3944 22.1857 11.7804 3.7842 7.1028 8.9300 31.1726 41.3203 10.8481 55.8308 30.4097 36.7985 23.3942 36.7377 10.6748 3.3229 0.2283 1.4943 1.3429 4.4542 0.0677 92.9903 12.6542 1.5478 5.3942 10.2011 2.1921 50.1790 11.3956 4.2162 41.7523 13.9363 5.8392 4.6379 80.8836 61.7957 128.4437 60.1484 38.5854 109.9934 1.9632 27.3945 18.8087 14.6624 5.4023 4.1198 80.8549 100.8888 24.5146 3.4253 6.1881 24.0828 32.5898 74.6882 59.8515 6.0732 3.3705 23.6667 75.7236 1.6046 10.6106 32.4135 41.8200 36.5448 28.7889 27.7166 4.5083 30.4170 16.7175 37.9761 24.8415 25.5883 32.2920 74.8380 16.3956 19.0726 59.7239 46.3875 25.1324 25.8723 49.2211 56.4506 8.4457 5.5009 11.2410 7.9911 27.5247 33.8509 24.0652 11.7346 34.6037 30.0150 10.9787 20.7192 2.4478 3.3226 18.0953 13.0800 5.9732 1.0424 4.0997 1.8115 7.0384
temp: 298.150 k
press: 1.00000 atm
elementType: 8 8 8 8 7 6 6 6 6 6 6 6 6 6 6 6 6 6 6 6 6 6 6 6 6 6 6 1 1 1 1 1 1 1 1 1 1 1 1 1 1 1 1 1 1 1 1 1 1 1 1 1 1 1 1
symmnumber: 1
zpe: 1204583.4 jmol-1
zpe.correction: 0.458802 hartree
zpe.thermalcorrener: 0.485023 hartree
zpe.thermalcorrenthalpy: 0.485968 hartree
zpe.thermalcorrgfe: 0.404003 hartree
zpe.sumelectzpe: -1208.474748 hartree
zpe.sumelectthermal: -1208.448526 hartree
zpe.sumelectthermalent: -1208.447582 hartree
zpe.sumelectthermalfe: -1208.529546 hartree
dipole: 7.3640 -7.4174 0.7094
dipole: 10.4761
quadrupole: -65.9687 -117.1060 -149.1961
quadrupole: -20.0412 -4.8121 -0.4689
quadrupole: 44.7882 -6.3490 -38.4392 -20.0412 -4.8121 -0.4689
hfenergy: -1208.9335492 hartree
pointgroup: C01 [X(C22H28N1O4)]
dipole: 2.617182 3.1381947 -0.5384261 debye
polarizability: 337.0723975|-2.9709633|303.7883154|-2.1605825|-18.0339207|168.902409 unknown
InChI: InChI=1S/C22H28NO4/c1-23(2)10-9-14-12-17(25-4)22(27-6)20-18(14)15(23)11-13-7-8-16(24-3)21(26-5)19(13)20/h7-8,12,15H,9-11H2,1-6H3
charge 1 multiplicity 1
55 atoms
O  -0.929584 -2.558561 -0.703164
O  1.260903 -4.194883 0.114958
O  -2.14937 -0.967816 1.196503
O  -4.303793 0.842261 0.898872
N  3.337195 1.946581 -0.04293
C  1.834085 1.524023 0.09277
C  4.139205 1.187816 1.039822
C  1.687113 0.003198 0.182219
C  0.951558 2.052786 -1.064913
C  4.157933 -0.316054 0.772109
C  2.768811 -0.860825 0.472196
C  3.480842 3.438869 0.231427
C  3.89382 1.638462 -1.428301
C  0.372132 -0.523788 -0.053937
C  -0.486865 1.740477 -0.679192
C  -0.755515 0.447909 -0.13459
C  2.554951 -2.253925 0.492929
C  0.222326 -1.935221 -0.199798
C  1.302474 -2.806725 0.153756
C  -1.510778 2.694283 -0.791521
C  -2.038559 0.184764 0.433051
C  -3.077538 1.169658 0.311486
C  -2.813858 2.399583 -0.329723
C  -1.458242 -2.067882 -1.993623
C  0.021066 -4.929269 0.460669
C  -3.383949 -1.785843 1.213974
C  -5.384412 1.837206 0.838887
H  1.509718 2.016151 1.034033
H  3.638282 1.415586 1.996958
H  5.15464 1.620487 1.053827
H  1.229966 1.53781 -2.005492
H  1.05962 3.140935 -1.217057
H  4.565903 -0.805196 1.676329
H  4.866765 -0.559873 -0.043105
H  4.537216 3.723522 0.106305
H  2.861057 4.008582 -0.474635
H  3.158058 3.647759 1.262801
H  3.642299 0.60499 -1.702546
H  3.451893 2.333324 -2.156197
H  4.986848 1.772054 -1.405474
H  3.364412 -2.948987 0.738157
H  -1.303351 3.67687 -1.2287
H  -3.60078 3.152397 -0.424003
H  -0.63951 -1.961454 -2.729038
H  -1.989081 -1.107137 -1.879973
H  -2.160464 -2.847233 -2.326371
H  -0.694709 -4.908587 -0.373849
H  -0.446887 -4.496103 1.362712
H  0.363906 -5.954907 0.663153
H  -3.794019 -1.903371 0.196123
H  -4.138456 -1.330202 1.871608
H  -3.054878 -2.761876 1.600422
H  -6.228886 1.369254 1.364076
H  -5.66919 2.05508 -0.207693
H  -5.093226 2.770843 1.355798
